Build failed in Jenkins: Dhis2 Web Trunk #2895

See <http://dhis.uio.no/ci/job/Dhis2%20Web%20Trunk/2895/changes>

Changes:

[Tran] Fix bug: Error when adding a representative ; don't reload searching-patient when clicking Back button.

···

------------------------------------------
Started by upstream project "Dhis2 Service Trunk" build number 3004
ERROR: Ignore Problem expanding maven opts macros org.jenkinsci.plugins.tokenmacro.TokenMacro
Deleting old artifacts from #2893
Parsing POMs
ERROR: Ignore Problem expanding maven opts macros org.jenkinsci.plugins.tokenmacro.TokenMacro
[dhis-web] $ /local/opt/j2sdk/bin/java -Xmx1024m -XX:MaxPermSize=512m -cp /llocal/dhis/jenkins_home/plugins/maven-plugin/WEB-INF/lib/maven-agent-1.2.jar:/llocal/dhis/jenkins_home/tools/2.2.1/boot/classworlds-1.1.jar hudson.maven.agent.Main /llocal/dhis/jenkins_home/tools/2.2.1 /ifi/utgard/p01/dhis/projects/dhis-1.ifi.uio.no/ci/tomcat/webapps/ci/WEB-INF/lib/remoting-1.417.jar /llocal/dhis/jenkins_home/plugins/maven-plugin/WEB-INF/lib/maven-interceptor-1.2.jar 34328 /llocal/dhis/jenkins_home/plugins/maven-plugin/WEB-INF/lib/maven2.1-interceptor-1.2.jar
<===[HUDSON REMOTING CAPACITY]===> channel started
Executing Maven: -B -f <http://dhis.uio.no/ci/job/Dhis2%20Web%20Trunk/ws/dhis-2/dhis-web/pom.xml> clean install findbugs:findbugs
[INFO] Scanning for projects...
[INFO] Reactor build order:
[INFO] DHIS Web Modules Project
[INFO] DHIS Common Functionality for Web
[INFO] DHIS Common Resources for Web
[INFO] DHIS Web Modules Maintenance
[INFO] DHIS Data Set Management
[INFO] DHIS Data Dictionary
[INFO] DHIS Organisation Unit Management
[INFO] DHIS Setting Maintenance
[INFO] DHIS User Maintenance
[INFO] DHIS Data Administration
[INFO] DHIS Patient Management
[INFO] DHIS Data Entry
[INFO] DHIS Import-Export
[INFO] DHIS Data Mart
[INFO] DHIS Validation Rule
[INFO] DHIS Web Reporting
[INFO] DHIS Mapping
[INFO] DHIS Web Dashboard Integration module
[INFO] DHIS Case Entry
[INFO] DHIS Web API
[INFO] DHIS Web Light
[INFO] DHIS Web Portal
[INFO] ------------------------------------------------------------------------
[INFO] Building DHIS Web Modules Project
[INFO] task-segment: [clean, install, findbugs:findbugs]
[INFO] ------------------------------------------------------------------------
[INFO] [clean:clean {execution: default-clean}]
[INFO] [site:attach-descriptor {execution: default-attach-descriptor}]
[INFO] [install:install {execution: default-install}]
[INFO] Installing <http://dhis.uio.no/ci/job/Dhis2%20Web%20Trunk/ws/dhis-2/dhis-web/pom.xml> to /ifi/utgard/p01/dhis/.m2/repository/org/hisp/dhis/dhis-web/2.4-SNAPSHOT/dhis-web-2.4-SNAPSHOT.pom
[WARNING] DEPRECATED [findbugsXmlOutput]: No reason given
[INFO] [findbugs:findbugs {execution: default-cli}]
[INFO] ****** FindBugsMojo execute *******
[INFO] canGenerate is false
[FINDBUGS] Using set difference to compute new warnings
[FINDBUGS] Not changing build status, since no threshold has been exceeded
[JENKINS] Archiving <http://dhis.uio.no/ci/job/Dhis2%20Web%20Trunk/ws/dhis-2/dhis-web/pom.xml> to /llocal/dhis/jenkins_home/jobs/Dhis2 Web Trunk/modules/org.hisp.dhis$dhis-web/builds/2011-07-19_06-11-54/archive/org.hisp.dhis/dhis-web/2.4-SNAPSHOT/dhis-web-2.4-SNAPSHOT.pom
[INFO] ------------------------------------------------------------------------
[INFO] Building DHIS Common Functionality for Web
[INFO] task-segment: [clean, install, findbugs:findbugs]
[INFO] ------------------------------------------------------------------------
[INFO] [clean:clean {execution: default-clean}]
[JENKINS] Archiving <http://dhis.uio.no/ci/job/Dhis2%20Web%20Trunk/ws/dhis-2/dhis-web/dhis-web-commons/pom.xml> to /llocal/dhis/jenkins_home/jobs/Dhis2 Web Trunk/modules/org.hisp.dhis$dhis-web-commons/builds/2011-07-19_06-11-54/archive/org.hisp.dhis/dhis-web-commons/2.4-SNAPSHOT/dhis-web-commons-2.4-SNAPSHOT.pom
[INFO] ------------------------------------------------------------------------
[ERROR] BUILD ERROR
[INFO] ------------------------------------------------------------------------
[INFO] Error building POM (may not be this project's POM).

Project ID: org.hisp.dhis:dhis-api

Reason: Error getting POM for 'org.hisp.dhis:dhis-api' from the repository: Unable to read local copy of metadata: Cannot read metadata from '/ifi/utgard/p01/dhis/.m2/repository/org/hisp/dhis/dhis-api/2.4-SNAPSHOT/maven-metadata-amplecode_maven2_repo.xml': end tag name </head> must be the same as start tag <link> from line 6 (position: TEXT seen ...e="text/css" rel="stylesheet" href="/static/styles.css">\n </head>... @7:10)
  org.hisp.dhis:dhis-api:pom:2.4-SNAPSHOT

for project org.hisp.dhis:dhis-api

[INFO] ------------------------------------------------------------------------
[INFO] For more information, run Maven with the -e switch
[INFO] ------------------------------------------------------------------------
[INFO] Total time: 10 seconds
[INFO] Finished at: Tue Jul 19 06:12:10 CEST 2011
[INFO] Final Memory: 40M/407M
[INFO] ------------------------------------------------------------------------
[FINDBUGS] Aggregating results of DHIS Web Modules Project
[FINDBUGS] Using set difference to compute new warnings
[FINDBUGS] Not changing build status, since no threshold has been exceeded
channel stopped
Archiving artifacts
ERROR: Ignore Problem expanding maven opts macros org.jenkinsci.plugins.tokenmacro.TokenMacro
Performing Post build task...
Could not match :DHIS Web Portal ....................................... SUCCESS : False
Logical operation result is FALSE
Skipping script : /ifi/utgard/p01/dhis/bin/ci/trunk.sh

END OF POST BUILD TASK : 0

See <http://dhis.uio.no/ci/job/Dhis2%20Web%20Trunk/2896/changes>

Changes:

[Morten Olav Hansen] more jquerification in ouwt

···

------------------------------------------
Started by upstream project "Dhis2 Service Trunk" build number 3005
ERROR: Ignore Problem expanding maven opts macros org.jenkinsci.plugins.tokenmacro.TokenMacro
Parsing POMs
ERROR: Ignore Problem expanding maven opts macros org.jenkinsci.plugins.tokenmacro.TokenMacro
[dhis-web] $ /local/opt/j2sdk/bin/java -Xmx1024m -XX:MaxPermSize=512m -cp /llocal/dhis/jenkins_home/plugins/maven-plugin/WEB-INF/lib/maven-agent-1.2.jar:/llocal/dhis/jenkins_home/tools/2.2.1/boot/classworlds-1.1.jar hudson.maven.agent.Main /llocal/dhis/jenkins_home/tools/2.2.1 /ifi/utgard/p01/dhis/projects/dhis-1.ifi.uio.no/ci/tomcat/webapps/ci/WEB-INF/lib/remoting-1.417.jar /llocal/dhis/jenkins_home/plugins/maven-plugin/WEB-INF/lib/maven-interceptor-1.2.jar 48401 /llocal/dhis/jenkins_home/plugins/maven-plugin/WEB-INF/lib/maven2.1-interceptor-1.2.jar
<===[HUDSON REMOTING CAPACITY]===> channel started
Executing Maven: -B -f <http://dhis.uio.no/ci/job/Dhis2%20Web%20Trunk/ws/dhis-2/dhis-web/pom.xml> clean install findbugs:findbugs
[INFO] Scanning for projects...
[INFO] Reactor build order:
[INFO] DHIS Web Modules Project
[INFO] DHIS Common Functionality for Web
[INFO] DHIS Common Resources for Web
[INFO] DHIS Web Modules Maintenance
[INFO] DHIS Data Set Management
[INFO] DHIS Data Dictionary
[INFO] DHIS Organisation Unit Management
[INFO] DHIS Setting Maintenance
[INFO] DHIS User Maintenance
[INFO] DHIS Data Administration
[INFO] DHIS Patient Management
[INFO] DHIS Data Entry
[INFO] DHIS Import-Export
[INFO] DHIS Data Mart
[INFO] DHIS Validation Rule
[INFO] DHIS Web Reporting
[INFO] DHIS Mapping
[INFO] DHIS Web Dashboard Integration module
[INFO] DHIS Case Entry
[INFO] DHIS Web API
[INFO] DHIS Web Light
[INFO] DHIS Web Portal
[INFO] ------------------------------------------------------------------------
[INFO] Building DHIS Web Modules Project
[INFO] task-segment: [clean, install, findbugs:findbugs]
[INFO] ------------------------------------------------------------------------
[INFO] [clean:clean {execution: default-clean}]
[INFO] [site:attach-descriptor {execution: default-attach-descriptor}]
[INFO] [install:install {execution: default-install}]
[INFO] Installing <http://dhis.uio.no/ci/job/Dhis2%20Web%20Trunk/ws/dhis-2/dhis-web/pom.xml> to /ifi/utgard/p01/dhis/.m2/repository/org/hisp/dhis/dhis-web/2.4-SNAPSHOT/dhis-web-2.4-SNAPSHOT.pom
[WARNING] DEPRECATED [findbugsXmlOutput]: No reason given
[INFO] [findbugs:findbugs {execution: default-cli}]
[INFO] ****** FindBugsMojo execute *******
[INFO] canGenerate is false
[FINDBUGS] Using set difference to compute new warnings
[FINDBUGS] Not changing build status, since no threshold has been exceeded
[JENKINS] Archiving <http://dhis.uio.no/ci/job/Dhis2%20Web%20Trunk/ws/dhis-2/dhis-web/pom.xml> to /llocal/dhis/jenkins_home/jobs/Dhis2 Web Trunk/modules/org.hisp.dhis$dhis-web/builds/2011-07-19_10-10-37/archive/org.hisp.dhis/dhis-web/2.4-SNAPSHOT/dhis-web-2.4-SNAPSHOT.pom
[INFO] ------------------------------------------------------------------------
[INFO] Building DHIS Common Functionality for Web
[INFO] task-segment: [clean, install, findbugs:findbugs]
[INFO] ------------------------------------------------------------------------
[INFO] [clean:clean {execution: default-clean}]
[JENKINS] Archiving <http://dhis.uio.no/ci/job/Dhis2%20Web%20Trunk/ws/dhis-2/dhis-web/dhis-web-commons/pom.xml> to /llocal/dhis/jenkins_home/jobs/Dhis2 Web Trunk/modules/org.hisp.dhis$dhis-web-commons/builds/2011-07-19_10-10-37/archive/org.hisp.dhis/dhis-web-commons/2.4-SNAPSHOT/dhis-web-commons-2.4-SNAPSHOT.pom
[INFO] ------------------------------------------------------------------------
[ERROR] BUILD ERROR
[INFO] ------------------------------------------------------------------------
[INFO] Error building POM (may not be this project's POM).

Project ID: org.hisp.dhis:dhis-api

Reason: Error getting POM for 'org.hisp.dhis:dhis-api' from the repository: Unable to read local copy of metadata: Cannot read metadata from '/ifi/utgard/p01/dhis/.m2/repository/org/hisp/dhis/dhis-api/2.4-SNAPSHOT/maven-metadata-amplecode_maven2_repo.xml': end tag name </head> must be the same as start tag <link> from line 6 (position: TEXT seen ...e="text/css" rel="stylesheet" href="/static/styles.css">\n </head>... @7:10)
  org.hisp.dhis:dhis-api:pom:2.4-SNAPSHOT

for project org.hisp.dhis:dhis-api

[INFO] ------------------------------------------------------------------------
[INFO] For more information, run Maven with the -e switch
[INFO] ------------------------------------------------------------------------
[INFO] Total time: 11 seconds
[INFO] Finished at: Tue Jul 19 10:10:54 CEST 2011
[INFO] Final Memory: 40M/407M
[INFO] ------------------------------------------------------------------------
[FINDBUGS] Aggregating results of DHIS Web Modules Project
[FINDBUGS] Using set difference to compute new warnings
[FINDBUGS] Not changing build status, since no threshold has been exceeded
channel stopped
Archiving artifacts
ERROR: Ignore Problem expanding maven opts macros org.jenkinsci.plugins.tokenmacro.TokenMacro
Performing Post build task...
Could not match :DHIS Web Portal ....................................... SUCCESS : False
Logical operation result is FALSE
Skipping script : /ifi/utgard/p01/dhis/bin/ci/trunk.sh

END OF POST BUILD TASK : 0

See <http://dhis.uio.no/ci/job/Dhis2%20Web%20Trunk/2897/changes>

Changes:

[Morten Olav Hansen] even more jquerification in ouwt

···

------------------------------------------
Started by upstream project "Dhis2 Service Trunk" build number 3006
ERROR: Ignore Problem expanding maven opts macros org.jenkinsci.plugins.tokenmacro.TokenMacro
Deleting old artifacts from #2895
Parsing POMs
ERROR: Ignore Problem expanding maven opts macros org.jenkinsci.plugins.tokenmacro.TokenMacro
[dhis-web] $ /local/opt/j2sdk/bin/java -Xmx1024m -XX:MaxPermSize=512m -cp /llocal/dhis/jenkins_home/plugins/maven-plugin/WEB-INF/lib/maven-agent-1.2.jar:/llocal/dhis/jenkins_home/tools/2.2.1/boot/classworlds-1.1.jar hudson.maven.agent.Main /llocal/dhis/jenkins_home/tools/2.2.1 /ifi/utgard/p01/dhis/projects/dhis-1.ifi.uio.no/ci/tomcat/webapps/ci/WEB-INF/lib/remoting-1.417.jar /llocal/dhis/jenkins_home/plugins/maven-plugin/WEB-INF/lib/maven-interceptor-1.2.jar 59518 /llocal/dhis/jenkins_home/plugins/maven-plugin/WEB-INF/lib/maven2.1-interceptor-1.2.jar
<===[HUDSON REMOTING CAPACITY]===> channel started
Executing Maven: -B -f <http://dhis.uio.no/ci/job/Dhis2%20Web%20Trunk/ws/dhis-2/dhis-web/pom.xml> clean install findbugs:findbugs
[INFO] Scanning for projects...
[INFO] Reactor build order:
[INFO] DHIS Web Modules Project
[INFO] DHIS Common Functionality for Web
[INFO] DHIS Common Resources for Web
[INFO] DHIS Web Modules Maintenance
[INFO] DHIS Data Set Management
[INFO] DHIS Data Dictionary
[INFO] DHIS Organisation Unit Management
[INFO] DHIS Setting Maintenance
[INFO] DHIS User Maintenance
[INFO] DHIS Data Administration
[INFO] DHIS Patient Management
[INFO] DHIS Data Entry
[INFO] DHIS Import-Export
[INFO] DHIS Data Mart
[INFO] DHIS Validation Rule
[INFO] DHIS Web Reporting
[INFO] DHIS Mapping
[INFO] DHIS Web Dashboard Integration module
[INFO] DHIS Case Entry
[INFO] DHIS Web API
[INFO] DHIS Web Light
[INFO] DHIS Web Portal
[INFO] ------------------------------------------------------------------------
[INFO] Building DHIS Web Modules Project
[INFO] task-segment: [clean, install, findbugs:findbugs]
[INFO] ------------------------------------------------------------------------
[INFO] [clean:clean {execution: default-clean}]
[INFO] [site:attach-descriptor {execution: default-attach-descriptor}]
[INFO] [install:install {execution: default-install}]
[INFO] Installing <http://dhis.uio.no/ci/job/Dhis2%20Web%20Trunk/ws/dhis-2/dhis-web/pom.xml> to /ifi/utgard/p01/dhis/.m2/repository/org/hisp/dhis/dhis-web/2.4-SNAPSHOT/dhis-web-2.4-SNAPSHOT.pom
[WARNING] DEPRECATED [findbugsXmlOutput]: No reason given
[INFO] [findbugs:findbugs {execution: default-cli}]
[INFO] ****** FindBugsMojo execute *******
[INFO] canGenerate is false
[FINDBUGS] Using set difference to compute new warnings
[FINDBUGS] Not changing build status, since no threshold has been exceeded
[JENKINS] Archiving <http://dhis.uio.no/ci/job/Dhis2%20Web%20Trunk/ws/dhis-2/dhis-web/pom.xml> to /llocal/dhis/jenkins_home/jobs/Dhis2 Web Trunk/modules/org.hisp.dhis$dhis-web/builds/2011-07-19_11-10-22/archive/org.hisp.dhis/dhis-web/2.4-SNAPSHOT/dhis-web-2.4-SNAPSHOT.pom
[INFO] ------------------------------------------------------------------------
[INFO] Building DHIS Common Functionality for Web
[INFO] task-segment: [clean, install, findbugs:findbugs]
[INFO] ------------------------------------------------------------------------
[INFO] [clean:clean {execution: default-clean}]
[JENKINS] Archiving <http://dhis.uio.no/ci/job/Dhis2%20Web%20Trunk/ws/dhis-2/dhis-web/dhis-web-commons/pom.xml> to /llocal/dhis/jenkins_home/jobs/Dhis2 Web Trunk/modules/org.hisp.dhis$dhis-web-commons/builds/2011-07-19_11-10-22/archive/org.hisp.dhis/dhis-web-commons/2.4-SNAPSHOT/dhis-web-commons-2.4-SNAPSHOT.pom
[INFO] ------------------------------------------------------------------------
[ERROR] BUILD ERROR
[INFO] ------------------------------------------------------------------------
[INFO] Error building POM (may not be this project's POM).

Project ID: org.hisp.dhis:dhis-api

Reason: Error getting POM for 'org.hisp.dhis:dhis-api' from the repository: Unable to read local copy of metadata: Cannot read metadata from '/ifi/utgard/p01/dhis/.m2/repository/org/hisp/dhis/dhis-api/2.4-SNAPSHOT/maven-metadata-amplecode_maven2_repo.xml': end tag name </head> must be the same as start tag <link> from line 6 (position: TEXT seen ...e="text/css" rel="stylesheet" href="/static/styles.css">\n </head>... @7:10)
  org.hisp.dhis:dhis-api:pom:2.4-SNAPSHOT

for project org.hisp.dhis:dhis-api

[INFO] ------------------------------------------------------------------------
[INFO] For more information, run Maven with the -e switch
[INFO] ------------------------------------------------------------------------
[INFO] Total time: 10 seconds
[INFO] Finished at: Tue Jul 19 11:10:38 CEST 2011
[INFO] Final Memory: 40M/400M
[INFO] ------------------------------------------------------------------------
[FINDBUGS] Aggregating results of DHIS Web Modules Project
[FINDBUGS] Using set difference to compute new warnings
[FINDBUGS] Not changing build status, since no threshold has been exceeded
channel stopped
Archiving artifacts
ERROR: Ignore Problem expanding maven opts macros org.jenkinsci.plugins.tokenmacro.TokenMacro
Performing Post build task...
Could not match :DHIS Web Portal ....................................... SUCCESS : False
Logical operation result is FALSE
Skipping script : /ifi/utgard/p01/dhis/bin/ci/trunk.sh

END OF POST BUILD TASK : 0

See <http://dhis.uio.no/ci/job/Dhis2%20Web%20Trunk/2898/changes>

Changes:

[Morten Olav Hansen] minor fixes in ouwt

[Tran Chau] Ajax Request stuff don't work does not work with IE9.

[Morten Olav Hansen] finished jquerification of ouwt

···

------------------------------------------
Started by upstream project "Dhis2 Service Trunk" build number 3007
ERROR: Ignore Problem expanding maven opts macros org.jenkinsci.plugins.tokenmacro.TokenMacro
Deleting old artifacts from #2896
Parsing POMs
ERROR: Ignore Problem expanding maven opts macros org.jenkinsci.plugins.tokenmacro.TokenMacro
[dhis-web] $ /local/opt/j2sdk/bin/java -Xmx1024m -XX:MaxPermSize=512m -cp /llocal/dhis/jenkins_home/plugins/maven-plugin/WEB-INF/lib/maven-agent-1.2.jar:/llocal/dhis/jenkins_home/tools/2.2.1/boot/classworlds-1.1.jar hudson.maven.agent.Main /llocal/dhis/jenkins_home/tools/2.2.1 /ifi/utgard/p01/dhis/projects/dhis-1.ifi.uio.no/ci/tomcat/webapps/ci/WEB-INF/lib/remoting-1.417.jar /llocal/dhis/jenkins_home/plugins/maven-plugin/WEB-INF/lib/maven-interceptor-1.2.jar 55433 /llocal/dhis/jenkins_home/plugins/maven-plugin/WEB-INF/lib/maven2.1-interceptor-1.2.jar
<===[HUDSON REMOTING CAPACITY]===> channel started
Executing Maven: -B -f <http://dhis.uio.no/ci/job/Dhis2%20Web%20Trunk/ws/dhis-2/dhis-web/pom.xml> clean install findbugs:findbugs
[INFO] Scanning for projects...
[INFO] Reactor build order:
[INFO] DHIS Web Modules Project
[INFO] DHIS Common Functionality for Web
[INFO] DHIS Common Resources for Web
[INFO] DHIS Web Modules Maintenance
[INFO] DHIS Data Set Management
[INFO] DHIS Data Dictionary
[INFO] DHIS Organisation Unit Management
[INFO] DHIS Setting Maintenance
[INFO] DHIS User Maintenance
[INFO] DHIS Data Administration
[INFO] DHIS Patient Management
[INFO] DHIS Data Entry
[INFO] DHIS Import-Export
[INFO] DHIS Data Mart
[INFO] DHIS Validation Rule
[INFO] DHIS Web Reporting
[INFO] DHIS Mapping
[INFO] DHIS Web Dashboard Integration module
[INFO] DHIS Case Entry
[INFO] DHIS Web API
[INFO] DHIS Web Light
[INFO] DHIS Web Portal
[INFO] ------------------------------------------------------------------------
[INFO] Building DHIS Web Modules Project
[INFO] task-segment: [clean, install, findbugs:findbugs]
[INFO] ------------------------------------------------------------------------
[INFO] [clean:clean {execution: default-clean}]
[INFO] [site:attach-descriptor {execution: default-attach-descriptor}]
[INFO] [install:install {execution: default-install}]
[INFO] Installing <http://dhis.uio.no/ci/job/Dhis2%20Web%20Trunk/ws/dhis-2/dhis-web/pom.xml> to /ifi/utgard/p01/dhis/.m2/repository/org/hisp/dhis/dhis-web/2.4-SNAPSHOT/dhis-web-2.4-SNAPSHOT.pom
[WARNING] DEPRECATED [findbugsXmlOutput]: No reason given
[INFO] [findbugs:findbugs {execution: default-cli}]
[INFO] ****** FindBugsMojo execute *******
[INFO] canGenerate is false
[FINDBUGS] Using set difference to compute new warnings
[FINDBUGS] Not changing build status, since no threshold has been exceeded
[JENKINS] Archiving <http://dhis.uio.no/ci/job/Dhis2%20Web%20Trunk/ws/dhis-2/dhis-web/pom.xml> to /llocal/dhis/jenkins_home/jobs/Dhis2 Web Trunk/modules/org.hisp.dhis$dhis-web/builds/2011-07-19_12-10-31/archive/org.hisp.dhis/dhis-web/2.4-SNAPSHOT/dhis-web-2.4-SNAPSHOT.pom
[INFO] ------------------------------------------------------------------------
[INFO] Building DHIS Common Functionality for Web
[INFO] task-segment: [clean, install, findbugs:findbugs]
[INFO] ------------------------------------------------------------------------
[INFO] [clean:clean {execution: default-clean}]
[JENKINS] Archiving <http://dhis.uio.no/ci/job/Dhis2%20Web%20Trunk/ws/dhis-2/dhis-web/dhis-web-commons/pom.xml> to /llocal/dhis/jenkins_home/jobs/Dhis2 Web Trunk/modules/org.hisp.dhis$dhis-web-commons/builds/2011-07-19_12-10-31/archive/org.hisp.dhis/dhis-web-commons/2.4-SNAPSHOT/dhis-web-commons-2.4-SNAPSHOT.pom
[INFO] ------------------------------------------------------------------------
[ERROR] BUILD ERROR
[INFO] ------------------------------------------------------------------------
[INFO] Error building POM (may not be this project's POM).

Project ID: org.hisp.dhis:dhis-api

Reason: Error getting POM for 'org.hisp.dhis:dhis-api' from the repository: Unable to read local copy of metadata: Cannot read metadata from '/ifi/utgard/p01/dhis/.m2/repository/org/hisp/dhis/dhis-api/2.4-SNAPSHOT/maven-metadata-amplecode_maven2_repo.xml': end tag name </head> must be the same as start tag <link> from line 6 (position: TEXT seen ...e="text/css" rel="stylesheet" href="/static/styles.css">\n </head>... @7:10)
  org.hisp.dhis:dhis-api:pom:2.4-SNAPSHOT

for project org.hisp.dhis:dhis-api

[INFO] ------------------------------------------------------------------------
[INFO] For more information, run Maven with the -e switch
[INFO] ------------------------------------------------------------------------
[INFO] Total time: 9 seconds
[INFO] Finished at: Tue Jul 19 12:10:46 CEST 2011
[INFO] Final Memory: 40M/408M
[INFO] ------------------------------------------------------------------------
[FINDBUGS] Aggregating results of DHIS Web Modules Project
[FINDBUGS] Using set difference to compute new warnings
[FINDBUGS] Not changing build status, since no threshold has been exceeded
channel stopped
Archiving artifacts
ERROR: Ignore Problem expanding maven opts macros org.jenkinsci.plugins.tokenmacro.TokenMacro
Performing Post build task...
Could not match :DHIS Web Portal ....................................... SUCCESS : False
Logical operation result is FALSE
Skipping script : /ifi/utgard/p01/dhis/bin/ci/trunk.sh

END OF POST BUILD TASK : 0

See <http://dhis.uio.no/ci/job/Dhis2%20Web%20Trunk/2899/changes>

Changes:

[Morten Olav Hansen] minor fix

···

------------------------------------------
Started by upstream project "Dhis2 Service Trunk" build number 3008
ERROR: Ignore Problem expanding maven opts macros org.jenkinsci.plugins.tokenmacro.TokenMacro
Deleting old artifacts from #2897
Parsing POMs
ERROR: Ignore Problem expanding maven opts macros org.jenkinsci.plugins.tokenmacro.TokenMacro
[dhis-web] $ /local/opt/j2sdk/bin/java -Xmx1024m -XX:MaxPermSize=512m -cp /llocal/dhis/jenkins_home/plugins/maven-plugin/WEB-INF/lib/maven-agent-1.2.jar:/llocal/dhis/jenkins_home/tools/2.2.1/boot/classworlds-1.1.jar hudson.maven.agent.Main /llocal/dhis/jenkins_home/tools/2.2.1 /ifi/utgard/p01/dhis/projects/dhis-1.ifi.uio.no/ci/tomcat/webapps/ci/WEB-INF/lib/remoting-1.417.jar /llocal/dhis/jenkins_home/plugins/maven-plugin/WEB-INF/lib/maven-interceptor-1.2.jar 33217 /llocal/dhis/jenkins_home/plugins/maven-plugin/WEB-INF/lib/maven2.1-interceptor-1.2.jar
<===[HUDSON REMOTING CAPACITY]===> channel started
Executing Maven: -B -f <http://dhis.uio.no/ci/job/Dhis2%20Web%20Trunk/ws/dhis-2/dhis-web/pom.xml> clean install findbugs:findbugs
[INFO] Scanning for projects...
[INFO] Reactor build order:
[INFO] DHIS Web Modules Project
[INFO] DHIS Common Functionality for Web
[INFO] DHIS Common Resources for Web
[INFO] DHIS Web Modules Maintenance
[INFO] DHIS Data Set Management
[INFO] DHIS Data Dictionary
[INFO] DHIS Organisation Unit Management
[INFO] DHIS Setting Maintenance
[INFO] DHIS User Maintenance
[INFO] DHIS Data Administration
[INFO] DHIS Patient Management
[INFO] DHIS Data Entry
[INFO] DHIS Import-Export
[INFO] DHIS Data Mart
[INFO] DHIS Validation Rule
[INFO] DHIS Web Reporting
[INFO] DHIS Mapping
[INFO] DHIS Web Dashboard Integration module
[INFO] DHIS Case Entry
[INFO] DHIS Web API
[INFO] DHIS Web Light
[INFO] DHIS Web Portal
[INFO] ------------------------------------------------------------------------
[INFO] Building DHIS Web Modules Project
[INFO] task-segment: [clean, install, findbugs:findbugs]
[INFO] ------------------------------------------------------------------------
[INFO] [clean:clean {execution: default-clean}]
[INFO] [site:attach-descriptor {execution: default-attach-descriptor}]
[INFO] [install:install {execution: default-install}]
[INFO] Installing <http://dhis.uio.no/ci/job/Dhis2%20Web%20Trunk/ws/dhis-2/dhis-web/pom.xml> to /ifi/utgard/p01/dhis/.m2/repository/org/hisp/dhis/dhis-web/2.4-SNAPSHOT/dhis-web-2.4-SNAPSHOT.pom
[WARNING] DEPRECATED [findbugsXmlOutput]: No reason given
[INFO] [findbugs:findbugs {execution: default-cli}]
[INFO] ****** FindBugsMojo execute *******
[INFO] canGenerate is false
[FINDBUGS] Using set difference to compute new warnings
[FINDBUGS] Not changing build status, since no threshold has been exceeded
[JENKINS] Archiving <http://dhis.uio.no/ci/job/Dhis2%20Web%20Trunk/ws/dhis-2/dhis-web/pom.xml> to /llocal/dhis/jenkins_home/jobs/Dhis2 Web Trunk/modules/org.hisp.dhis$dhis-web/builds/2011-07-19_13-10-20/archive/org.hisp.dhis/dhis-web/2.4-SNAPSHOT/dhis-web-2.4-SNAPSHOT.pom
[INFO] ------------------------------------------------------------------------
[INFO] Building DHIS Common Functionality for Web
[INFO] task-segment: [clean, install, findbugs:findbugs]
[INFO] ------------------------------------------------------------------------
[INFO] [clean:clean {execution: default-clean}]
[JENKINS] Archiving <http://dhis.uio.no/ci/job/Dhis2%20Web%20Trunk/ws/dhis-2/dhis-web/dhis-web-commons/pom.xml> to /llocal/dhis/jenkins_home/jobs/Dhis2 Web Trunk/modules/org.hisp.dhis$dhis-web-commons/builds/2011-07-19_13-10-20/archive/org.hisp.dhis/dhis-web-commons/2.4-SNAPSHOT/dhis-web-commons-2.4-SNAPSHOT.pom
[INFO] ------------------------------------------------------------------------
[ERROR] BUILD ERROR
[INFO] ------------------------------------------------------------------------
[INFO] Error building POM (may not be this project's POM).

Project ID: org.hisp.dhis:dhis-api

Reason: Error getting POM for 'org.hisp.dhis:dhis-api' from the repository: Unable to read local copy of metadata: Cannot read metadata from '/ifi/utgard/p01/dhis/.m2/repository/org/hisp/dhis/dhis-api/2.4-SNAPSHOT/maven-metadata-amplecode_maven2_repo.xml': end tag name </head> must be the same as start tag <link> from line 6 (position: TEXT seen ...e="text/css" rel="stylesheet" href="/static/styles.css">\n </head>... @7:10)
  org.hisp.dhis:dhis-api:pom:2.4-SNAPSHOT

for project org.hisp.dhis:dhis-api

[INFO] ------------------------------------------------------------------------
[INFO] For more information, run Maven with the -e switch
[INFO] ------------------------------------------------------------------------
[INFO] Total time: 9 seconds
[INFO] Finished at: Tue Jul 19 13:10:35 CEST 2011
[INFO] Final Memory: 40M/407M
[INFO] ------------------------------------------------------------------------
[FINDBUGS] Aggregating results of DHIS Web Modules Project
[FINDBUGS] Using set difference to compute new warnings
[FINDBUGS] Not changing build status, since no threshold has been exceeded
channel stopped
Archiving artifacts
ERROR: Ignore Problem expanding maven opts macros org.jenkinsci.plugins.tokenmacro.TokenMacro
Performing Post build task...
Could not match :DHIS Web Portal ....................................... SUCCESS : False
Logical operation result is FALSE
Skipping script : /ifi/utgard/p01/dhis/bin/ci/trunk.sh

END OF POST BUILD TASK : 0

See <http://dhis.uio.no/ci/job/Dhis2%20Web%20Trunk/2900/changes>

Changes:

[Tran Chau] Fix bug: Error when upgrading data entry forms.

···

------------------------------------------
Started by upstream project "Dhis2 Service Trunk" build number 3009
ERROR: Ignore Problem expanding maven opts macros org.jenkinsci.plugins.tokenmacro.TokenMacro
Deleting old artifacts from #2898
Parsing POMs
ERROR: Ignore Problem expanding maven opts macros org.jenkinsci.plugins.tokenmacro.TokenMacro
[dhis-web] $ /local/opt/j2sdk/bin/java -Xmx1024m -XX:MaxPermSize=512m -cp /llocal/dhis/jenkins_home/plugins/maven-plugin/WEB-INF/lib/maven-agent-1.2.jar:/llocal/dhis/jenkins_home/tools/2.2.1/boot/classworlds-1.1.jar hudson.maven.agent.Main /llocal/dhis/jenkins_home/tools/2.2.1 /ifi/utgard/p01/dhis/projects/dhis-1.ifi.uio.no/ci/tomcat/webapps/ci/WEB-INF/lib/remoting-1.417.jar /llocal/dhis/jenkins_home/plugins/maven-plugin/WEB-INF/lib/maven-interceptor-1.2.jar 54201 /llocal/dhis/jenkins_home/plugins/maven-plugin/WEB-INF/lib/maven2.1-interceptor-1.2.jar
<===[HUDSON REMOTING CAPACITY]===> channel started
Executing Maven: -B -f <http://dhis.uio.no/ci/job/Dhis2%20Web%20Trunk/ws/dhis-2/dhis-web/pom.xml> clean install findbugs:findbugs
[INFO] Scanning for projects...
[INFO] Reactor build order:
[INFO] DHIS Web Modules Project
[INFO] DHIS Common Functionality for Web
[INFO] DHIS Common Resources for Web
[INFO] DHIS Web Modules Maintenance
[INFO] DHIS Data Set Management
[INFO] DHIS Data Dictionary
[INFO] DHIS Organisation Unit Management
[INFO] DHIS Setting Maintenance
[INFO] DHIS User Maintenance
[INFO] DHIS Data Administration
[INFO] DHIS Patient Management
[INFO] DHIS Data Entry
[INFO] DHIS Import-Export
[INFO] DHIS Data Mart
[INFO] DHIS Validation Rule
[INFO] DHIS Web Reporting
[INFO] DHIS Mapping
[INFO] DHIS Web Dashboard Integration module
[INFO] DHIS Case Entry
[INFO] DHIS Web API
[INFO] DHIS Web Light
[INFO] DHIS Web Portal
[INFO] ------------------------------------------------------------------------
[INFO] Building DHIS Web Modules Project
[INFO] task-segment: [clean, install, findbugs:findbugs]
[INFO] ------------------------------------------------------------------------
[INFO] [clean:clean {execution: default-clean}]
[INFO] [site:attach-descriptor {execution: default-attach-descriptor}]
[INFO] [install:install {execution: default-install}]
[INFO] Installing <http://dhis.uio.no/ci/job/Dhis2%20Web%20Trunk/ws/dhis-2/dhis-web/pom.xml> to /ifi/utgard/p01/dhis/.m2/repository/org/hisp/dhis/dhis-web/2.4-SNAPSHOT/dhis-web-2.4-SNAPSHOT.pom
[WARNING] DEPRECATED [findbugsXmlOutput]: No reason given
[INFO] [findbugs:findbugs {execution: default-cli}]
[INFO] ****** FindBugsMojo execute *******
[INFO] canGenerate is false
[FINDBUGS] Using set difference to compute new warnings
[FINDBUGS] Not changing build status, since no threshold has been exceeded
[JENKINS] Archiving <http://dhis.uio.no/ci/job/Dhis2%20Web%20Trunk/ws/dhis-2/dhis-web/pom.xml> to /llocal/dhis/jenkins_home/jobs/Dhis2 Web Trunk/modules/org.hisp.dhis$dhis-web/builds/2011-07-20_06-10-37/archive/org.hisp.dhis/dhis-web/2.4-SNAPSHOT/dhis-web-2.4-SNAPSHOT.pom
[INFO] ------------------------------------------------------------------------
[INFO] Building DHIS Common Functionality for Web
[INFO] task-segment: [clean, install, findbugs:findbugs]
[INFO] ------------------------------------------------------------------------
[INFO] [clean:clean {execution: default-clean}]
[JENKINS] Archiving <http://dhis.uio.no/ci/job/Dhis2%20Web%20Trunk/ws/dhis-2/dhis-web/dhis-web-commons/pom.xml> to /llocal/dhis/jenkins_home/jobs/Dhis2 Web Trunk/modules/org.hisp.dhis$dhis-web-commons/builds/2011-07-20_06-10-37/archive/org.hisp.dhis/dhis-web-commons/2.4-SNAPSHOT/dhis-web-commons-2.4-SNAPSHOT.pom
[INFO] ------------------------------------------------------------------------
[ERROR] BUILD ERROR
[INFO] ------------------------------------------------------------------------
[INFO] Error building POM (may not be this project's POM).

Project ID: org.hisp.dhis:dhis-api

Reason: Error getting POM for 'org.hisp.dhis:dhis-api' from the repository: Unable to read local copy of metadata: Cannot read metadata from '/ifi/utgard/p01/dhis/.m2/repository/org/hisp/dhis/dhis-api/2.4-SNAPSHOT/maven-metadata-amplecode_maven2_repo.xml': end tag name </head> must be the same as start tag <link> from line 6 (position: TEXT seen ...e="text/css" rel="stylesheet" href="/static/styles.css">\n </head>... @7:10)
  org.hisp.dhis:dhis-api:pom:2.4-SNAPSHOT

for project org.hisp.dhis:dhis-api

[INFO] ------------------------------------------------------------------------
[INFO] For more information, run Maven with the -e switch
[INFO] ------------------------------------------------------------------------
[INFO] Total time: 9 seconds
[INFO] Finished at: Wed Jul 20 06:10:51 CEST 2011
[INFO] Final Memory: 40M/407M
[INFO] ------------------------------------------------------------------------
[FINDBUGS] Aggregating results of DHIS Web Modules Project
[FINDBUGS] Using set difference to compute new warnings
[FINDBUGS] Not changing build status, since no threshold has been exceeded
channel stopped
Archiving artifacts
ERROR: Ignore Problem expanding maven opts macros org.jenkinsci.plugins.tokenmacro.TokenMacro
Performing Post build task...
Could not match :DHIS Web Portal ....................................... SUCCESS : False
Logical operation result is FALSE
Skipping script : /ifi/utgard/p01/dhis/bin/ci/trunk.sh

END OF POST BUILD TASK : 0

See <http://dhis.uio.no/ci/job/Dhis2%20Web%20Trunk/2901/changes>

Changes:

[Tran Chau] Ajax Request stuff don't work does not work with IE9 ( patient module ).

···

------------------------------------------
Started by upstream project "Dhis2 Service Trunk" build number 3010
ERROR: Ignore Problem expanding maven opts macros org.jenkinsci.plugins.tokenmacro.TokenMacro
Deleting old artifacts from #2899
Parsing POMs
ERROR: Ignore Problem expanding maven opts macros org.jenkinsci.plugins.tokenmacro.TokenMacro
[dhis-web] $ /local/opt/j2sdk/bin/java -Xmx1024m -XX:MaxPermSize=512m -cp /llocal/dhis/jenkins_home/plugins/maven-plugin/WEB-INF/lib/maven-agent-1.2.jar:/llocal/dhis/jenkins_home/tools/2.2.1/boot/classworlds-1.1.jar hudson.maven.agent.Main /llocal/dhis/jenkins_home/tools/2.2.1 /ifi/utgard/p01/dhis/projects/dhis-1.ifi.uio.no/ci/tomcat/webapps/ci/WEB-INF/lib/remoting-1.417.jar /llocal/dhis/jenkins_home/plugins/maven-plugin/WEB-INF/lib/maven-interceptor-1.2.jar 49206 /llocal/dhis/jenkins_home/plugins/maven-plugin/WEB-INF/lib/maven2.1-interceptor-1.2.jar
<===[HUDSON REMOTING CAPACITY]===> channel started
Executing Maven: -B -f <http://dhis.uio.no/ci/job/Dhis2%20Web%20Trunk/ws/dhis-2/dhis-web/pom.xml> clean install findbugs:findbugs
[INFO] Scanning for projects...
[INFO] Reactor build order:
[INFO] DHIS Web Modules Project
[INFO] DHIS Common Functionality for Web
[INFO] DHIS Common Resources for Web
[INFO] DHIS Web Modules Maintenance
[INFO] DHIS Data Set Management
[INFO] DHIS Data Dictionary
[INFO] DHIS Organisation Unit Management
[INFO] DHIS Setting Maintenance
[INFO] DHIS User Maintenance
[INFO] DHIS Data Administration
[INFO] DHIS Patient Management
[INFO] DHIS Data Entry
[INFO] DHIS Import-Export
[INFO] DHIS Data Mart
[INFO] DHIS Validation Rule
[INFO] DHIS Web Reporting
[INFO] DHIS Mapping
[INFO] DHIS Web Dashboard Integration module
[INFO] DHIS Case Entry
[INFO] DHIS Web API
[INFO] DHIS Web Light
[INFO] DHIS Web Portal
[INFO] ------------------------------------------------------------------------
[INFO] Building DHIS Web Modules Project
[INFO] task-segment: [clean, install, findbugs:findbugs]
[INFO] ------------------------------------------------------------------------
[INFO] [clean:clean {execution: default-clean}]
[INFO] [site:attach-descriptor {execution: default-attach-descriptor}]
[INFO] [install:install {execution: default-install}]
[INFO] Installing <http://dhis.uio.no/ci/job/Dhis2%20Web%20Trunk/ws/dhis-2/dhis-web/pom.xml> to /ifi/utgard/p01/dhis/.m2/repository/org/hisp/dhis/dhis-web/2.4-SNAPSHOT/dhis-web-2.4-SNAPSHOT.pom
[WARNING] DEPRECATED [findbugsXmlOutput]: No reason given
[INFO] [findbugs:findbugs {execution: default-cli}]
[INFO] ****** FindBugsMojo execute *******
[INFO] canGenerate is false
[FINDBUGS] Using set difference to compute new warnings
[FINDBUGS] Not changing build status, since no threshold has been exceeded
[JENKINS] Archiving <http://dhis.uio.no/ci/job/Dhis2%20Web%20Trunk/ws/dhis-2/dhis-web/pom.xml> to /llocal/dhis/jenkins_home/jobs/Dhis2 Web Trunk/modules/org.hisp.dhis$dhis-web/builds/2011-07-20_09-10-39/archive/org.hisp.dhis/dhis-web/2.4-SNAPSHOT/dhis-web-2.4-SNAPSHOT.pom
[INFO] ------------------------------------------------------------------------
[INFO] Building DHIS Common Functionality for Web
[INFO] task-segment: [clean, install, findbugs:findbugs]
[INFO] ------------------------------------------------------------------------
[INFO] [clean:clean {execution: default-clean}]
[JENKINS] Archiving <http://dhis.uio.no/ci/job/Dhis2%20Web%20Trunk/ws/dhis-2/dhis-web/dhis-web-commons/pom.xml> to /llocal/dhis/jenkins_home/jobs/Dhis2 Web Trunk/modules/org.hisp.dhis$dhis-web-commons/builds/2011-07-20_09-10-39/archive/org.hisp.dhis/dhis-web-commons/2.4-SNAPSHOT/dhis-web-commons-2.4-SNAPSHOT.pom
[INFO] ------------------------------------------------------------------------
[ERROR] BUILD ERROR
[INFO] ------------------------------------------------------------------------
[INFO] Error building POM (may not be this project's POM).

Project ID: org.hisp.dhis:dhis-api

Reason: Error getting POM for 'org.hisp.dhis:dhis-api' from the repository: Unable to read local copy of metadata: Cannot read metadata from '/ifi/utgard/p01/dhis/.m2/repository/org/hisp/dhis/dhis-api/2.4-SNAPSHOT/maven-metadata-amplecode_maven2_repo.xml': end tag name </head> must be the same as start tag <link> from line 6 (position: TEXT seen ...e="text/css" rel="stylesheet" href="/static/styles.css">\n </head>... @7:10)
  org.hisp.dhis:dhis-api:pom:2.4-SNAPSHOT

for project org.hisp.dhis:dhis-api

[INFO] ------------------------------------------------------------------------
[INFO] For more information, run Maven with the -e switch
[INFO] ------------------------------------------------------------------------
[INFO] Total time: 10 seconds
[INFO] Finished at: Wed Jul 20 09:10:55 CEST 2011
[INFO] Final Memory: 40M/407M
[INFO] ------------------------------------------------------------------------
[FINDBUGS] Aggregating results of DHIS Web Modules Project
[FINDBUGS] Using set difference to compute new warnings
[FINDBUGS] Not changing build status, since no threshold has been exceeded
channel stopped
Archiving artifacts
ERROR: Ignore Problem expanding maven opts macros org.jenkinsci.plugins.tokenmacro.TokenMacro
Performing Post build task...
Could not match :DHIS Web Portal ....................................... SUCCESS : False
Logical operation result is FALSE
Skipping script : /ifi/utgard/p01/dhis/bin/ci/trunk.sh

END OF POST BUILD TASK : 0

See <http://dhis.uio.no/ci/job/Dhis2%20Web%20Trunk/2902/changes>

Changes:

[Hieu] local vn:
- Added new function in allowing user to copy import item to export report.
- Filtered the respective reports before copying by report type.
- Renamed stuff.

···

------------------------------------------
Started by upstream project "Dhis2 Service Trunk" build number 3011
ERROR: Ignore Problem expanding maven opts macros org.jenkinsci.plugins.tokenmacro.TokenMacro
Deleting old artifacts from #2900
Parsing POMs
ERROR: Ignore Problem expanding maven opts macros org.jenkinsci.plugins.tokenmacro.TokenMacro
[dhis-web] $ /local/opt/j2sdk/bin/java -Xmx1024m -XX:MaxPermSize=512m -cp /llocal/dhis/jenkins_home/plugins/maven-plugin/WEB-INF/lib/maven-agent-1.2.jar:/llocal/dhis/jenkins_home/tools/2.2.1/boot/classworlds-1.1.jar hudson.maven.agent.Main /llocal/dhis/jenkins_home/tools/2.2.1 /ifi/utgard/p01/dhis/projects/dhis-1.ifi.uio.no/ci/tomcat/webapps/ci/WEB-INF/lib/remoting-1.417.jar /llocal/dhis/jenkins_home/plugins/maven-plugin/WEB-INF/lib/maven-interceptor-1.2.jar 38520 /llocal/dhis/jenkins_home/plugins/maven-plugin/WEB-INF/lib/maven2.1-interceptor-1.2.jar
<===[HUDSON REMOTING CAPACITY]===> channel started
Executing Maven: -B -f <http://dhis.uio.no/ci/job/Dhis2%20Web%20Trunk/ws/dhis-2/dhis-web/pom.xml> clean install findbugs:findbugs
[INFO] Scanning for projects...
[INFO] Reactor build order:
[INFO] DHIS Web Modules Project
[INFO] DHIS Common Functionality for Web
[INFO] DHIS Common Resources for Web
[INFO] DHIS Web Modules Maintenance
[INFO] DHIS Data Set Management
[INFO] DHIS Data Dictionary
[INFO] DHIS Organisation Unit Management
[INFO] DHIS Setting Maintenance
[INFO] DHIS User Maintenance
[INFO] DHIS Data Administration
[INFO] DHIS Patient Management
[INFO] DHIS Data Entry
[INFO] DHIS Import-Export
[INFO] DHIS Data Mart
[INFO] DHIS Validation Rule
[INFO] DHIS Web Reporting
[INFO] DHIS Mapping
[INFO] DHIS Web Dashboard Integration module
[INFO] DHIS Case Entry
[INFO] DHIS Web API
[INFO] DHIS Web Light
[INFO] DHIS Web Portal
[INFO] ------------------------------------------------------------------------
[INFO] Building DHIS Web Modules Project
[INFO] task-segment: [clean, install, findbugs:findbugs]
[INFO] ------------------------------------------------------------------------
[INFO] [clean:clean {execution: default-clean}]
[INFO] [site:attach-descriptor {execution: default-attach-descriptor}]
[INFO] [install:install {execution: default-install}]
[INFO] Installing <http://dhis.uio.no/ci/job/Dhis2%20Web%20Trunk/ws/dhis-2/dhis-web/pom.xml> to /ifi/utgard/p01/dhis/.m2/repository/org/hisp/dhis/dhis-web/2.4-SNAPSHOT/dhis-web-2.4-SNAPSHOT.pom
[WARNING] DEPRECATED [findbugsXmlOutput]: No reason given
[INFO] [findbugs:findbugs {execution: default-cli}]
[INFO] ****** FindBugsMojo execute *******
[INFO] canGenerate is false
[FINDBUGS] Using set difference to compute new warnings
[FINDBUGS] Not changing build status, since no threshold has been exceeded
[JENKINS] Archiving <http://dhis.uio.no/ci/job/Dhis2%20Web%20Trunk/ws/dhis-2/dhis-web/pom.xml> to /llocal/dhis/jenkins_home/jobs/Dhis2 Web Trunk/modules/org.hisp.dhis$dhis-web/builds/2011-07-20_10-11-24/archive/org.hisp.dhis/dhis-web/2.4-SNAPSHOT/dhis-web-2.4-SNAPSHOT.pom
[INFO] ------------------------------------------------------------------------
[INFO] Building DHIS Common Functionality for Web
[INFO] task-segment: [clean, install, findbugs:findbugs]
[INFO] ------------------------------------------------------------------------
[INFO] [clean:clean {execution: default-clean}]
[JENKINS] Archiving <http://dhis.uio.no/ci/job/Dhis2%20Web%20Trunk/ws/dhis-2/dhis-web/dhis-web-commons/pom.xml> to /llocal/dhis/jenkins_home/jobs/Dhis2 Web Trunk/modules/org.hisp.dhis$dhis-web-commons/builds/2011-07-20_10-11-24/archive/org.hisp.dhis/dhis-web-commons/2.4-SNAPSHOT/dhis-web-commons-2.4-SNAPSHOT.pom
[INFO] ------------------------------------------------------------------------
[ERROR] BUILD ERROR
[INFO] ------------------------------------------------------------------------
[INFO] Error building POM (may not be this project's POM).

Project ID: org.hisp.dhis:dhis-api

Reason: Error getting POM for 'org.hisp.dhis:dhis-api' from the repository: Unable to read local copy of metadata: Cannot read metadata from '/ifi/utgard/p01/dhis/.m2/repository/org/hisp/dhis/dhis-api/2.4-SNAPSHOT/maven-metadata-amplecode_maven2_repo.xml': end tag name </head> must be the same as start tag <link> from line 6 (position: TEXT seen ...e="text/css" rel="stylesheet" href="/static/styles.css">\n </head>... @7:10)
  org.hisp.dhis:dhis-api:pom:2.4-SNAPSHOT

for project org.hisp.dhis:dhis-api

[INFO] ------------------------------------------------------------------------
[INFO] For more information, run Maven with the -e switch
[INFO] ------------------------------------------------------------------------
[INFO] Total time: 9 seconds
[INFO] Finished at: Wed Jul 20 10:11:40 CEST 2011
[INFO] Final Memory: 40M/407M
[INFO] ------------------------------------------------------------------------
[FINDBUGS] Aggregating results of DHIS Web Modules Project
[FINDBUGS] Using set difference to compute new warnings
[FINDBUGS] Not changing build status, since no threshold has been exceeded
channel stopped
Archiving artifacts
ERROR: Ignore Problem expanding maven opts macros org.jenkinsci.plugins.tokenmacro.TokenMacro
Performing Post build task...
Could not match :DHIS Web Portal ....................................... SUCCESS : False
Logical operation result is FALSE
Skipping script : /ifi/utgard/p01/dhis/bin/ci/trunk.sh

END OF POST BUILD TASK : 0

See <http://dhis.uio.no/ci/job/Dhis2%20Web%20Trunk/2903/changes>

Changes:

[Morten Olav Hansen] minor fix

[Tran Chau] Ajax Request stuff don't work does not work with IE9 ( Patient module ).

···

------------------------------------------
Started by upstream project "Dhis2 Service Trunk" build number 3012
ERROR: Ignore Problem expanding maven opts macros org.jenkinsci.plugins.tokenmacro.TokenMacro
Deleting old artifacts from #2901
Parsing POMs
ERROR: Ignore Problem expanding maven opts macros org.jenkinsci.plugins.tokenmacro.TokenMacro
[dhis-web] $ /local/opt/j2sdk/bin/java -Xmx1024m -XX:MaxPermSize=512m -cp /llocal/dhis/jenkins_home/plugins/maven-plugin/WEB-INF/lib/maven-agent-1.2.jar:/llocal/dhis/jenkins_home/tools/2.2.1/boot/classworlds-1.1.jar hudson.maven.agent.Main /llocal/dhis/jenkins_home/tools/2.2.1 /ifi/utgard/p01/dhis/projects/dhis-1.ifi.uio.no/ci/tomcat/webapps/ci/WEB-INF/lib/remoting-1.417.jar /llocal/dhis/jenkins_home/plugins/maven-plugin/WEB-INF/lib/maven-interceptor-1.2.jar 40924 /llocal/dhis/jenkins_home/plugins/maven-plugin/WEB-INF/lib/maven2.1-interceptor-1.2.jar
<===[HUDSON REMOTING CAPACITY]===> channel started
Executing Maven: -B -f <http://dhis.uio.no/ci/job/Dhis2%20Web%20Trunk/ws/dhis-2/dhis-web/pom.xml> clean install findbugs:findbugs
[INFO] Scanning for projects...
[INFO] Reactor build order:
[INFO] DHIS Web Modules Project
[INFO] DHIS Common Functionality for Web
[INFO] DHIS Common Resources for Web
[INFO] DHIS Web Modules Maintenance
[INFO] DHIS Data Set Management
[INFO] DHIS Data Dictionary
[INFO] DHIS Organisation Unit Management
[INFO] DHIS Setting Maintenance
[INFO] DHIS User Maintenance
[INFO] DHIS Data Administration
[INFO] DHIS Patient Management
[INFO] DHIS Data Entry
[INFO] DHIS Import-Export
[INFO] DHIS Data Mart
[INFO] DHIS Validation Rule
[INFO] DHIS Web Reporting
[INFO] DHIS Mapping
[INFO] DHIS Web Dashboard Integration module
[INFO] DHIS Case Entry
[INFO] DHIS Web API
[INFO] DHIS Web Light
[INFO] DHIS Web Portal
[INFO] ------------------------------------------------------------------------
[INFO] Building DHIS Web Modules Project
[INFO] task-segment: [clean, install, findbugs:findbugs]
[INFO] ------------------------------------------------------------------------
[INFO] [clean:clean {execution: default-clean}]
[INFO] [site:attach-descriptor {execution: default-attach-descriptor}]
[INFO] [install:install {execution: default-install}]
[INFO] Installing <http://dhis.uio.no/ci/job/Dhis2%20Web%20Trunk/ws/dhis-2/dhis-web/pom.xml> to /ifi/utgard/p01/dhis/.m2/repository/org/hisp/dhis/dhis-web/2.4-SNAPSHOT/dhis-web-2.4-SNAPSHOT.pom
[WARNING] DEPRECATED [findbugsXmlOutput]: No reason given
[INFO] [findbugs:findbugs {execution: default-cli}]
[INFO] ****** FindBugsMojo execute *******
[INFO] canGenerate is false
[FINDBUGS] Using set difference to compute new warnings
[FINDBUGS] Not changing build status, since no threshold has been exceeded
[JENKINS] Archiving <http://dhis.uio.no/ci/job/Dhis2%20Web%20Trunk/ws/dhis-2/dhis-web/pom.xml> to /llocal/dhis/jenkins_home/jobs/Dhis2 Web Trunk/modules/org.hisp.dhis$dhis-web/builds/2011-07-20_11-10-56/archive/org.hisp.dhis/dhis-web/2.4-SNAPSHOT/dhis-web-2.4-SNAPSHOT.pom
[INFO] ------------------------------------------------------------------------
[INFO] Building DHIS Common Functionality for Web
[INFO] task-segment: [clean, install, findbugs:findbugs]
[INFO] ------------------------------------------------------------------------
[INFO] [clean:clean {execution: default-clean}]
[JENKINS] Archiving <http://dhis.uio.no/ci/job/Dhis2%20Web%20Trunk/ws/dhis-2/dhis-web/dhis-web-commons/pom.xml> to /llocal/dhis/jenkins_home/jobs/Dhis2 Web Trunk/modules/org.hisp.dhis$dhis-web-commons/builds/2011-07-20_11-10-56/archive/org.hisp.dhis/dhis-web-commons/2.4-SNAPSHOT/dhis-web-commons-2.4-SNAPSHOT.pom
[INFO] ------------------------------------------------------------------------
[ERROR] BUILD ERROR
[INFO] ------------------------------------------------------------------------
[INFO] Error building POM (may not be this project's POM).

Project ID: org.hisp.dhis:dhis-api

Reason: Error getting POM for 'org.hisp.dhis:dhis-api' from the repository: Unable to read local copy of metadata: Cannot read metadata from '/ifi/utgard/p01/dhis/.m2/repository/org/hisp/dhis/dhis-api/2.4-SNAPSHOT/maven-metadata-amplecode_maven2_repo.xml': end tag name </head> must be the same as start tag <link> from line 6 (position: TEXT seen ...e="text/css" rel="stylesheet" href="/static/styles.css">\n </head>... @7:10)
  org.hisp.dhis:dhis-api:pom:2.4-SNAPSHOT

for project org.hisp.dhis:dhis-api

[INFO] ------------------------------------------------------------------------
[INFO] For more information, run Maven with the -e switch
[INFO] ------------------------------------------------------------------------
[INFO] Total time: 10 seconds
[INFO] Finished at: Wed Jul 20 11:11:12 CEST 2011
[INFO] Final Memory: 40M/407M
[INFO] ------------------------------------------------------------------------
[FINDBUGS] Aggregating results of DHIS Web Modules Project
[FINDBUGS] Using set difference to compute new warnings
[FINDBUGS] Not changing build status, since no threshold has been exceeded
channel stopped
Archiving artifacts
ERROR: Ignore Problem expanding maven opts macros org.jenkinsci.plugins.tokenmacro.TokenMacro
Performing Post build task...
Could not match :DHIS Web Portal ....................................... SUCCESS : False
Logical operation result is FALSE
Skipping script : /ifi/utgard/p01/dhis/bin/ci/trunk.sh

END OF POST BUILD TASK : 0

See <http://dhis.uio.no/ci/job/Dhis2%20Web%20Trunk/2904/changes>

Changes:

[Tran Chau] Fixed bug: The patient list is not displayed properly when selecting sorted attributes ( Patient module ).

···

------------------------------------------
Started by upstream project "Dhis2 Service Trunk" build number 3013
ERROR: Ignore Problem expanding maven opts macros org.jenkinsci.plugins.tokenmacro.TokenMacro
Deleting old artifacts from #2902
Parsing POMs
ERROR: Ignore Problem expanding maven opts macros org.jenkinsci.plugins.tokenmacro.TokenMacro
[dhis-web] $ /local/opt/j2sdk/bin/java -Xmx1024m -XX:MaxPermSize=512m -cp /llocal/dhis/jenkins_home/plugins/maven-plugin/WEB-INF/lib/maven-agent-1.2.jar:/llocal/dhis/jenkins_home/tools/2.2.1/boot/classworlds-1.1.jar hudson.maven.agent.Main /llocal/dhis/jenkins_home/tools/2.2.1 /ifi/utgard/p01/dhis/projects/dhis-1.ifi.uio.no/ci/tomcat/webapps/ci/WEB-INF/lib/remoting-1.417.jar /llocal/dhis/jenkins_home/plugins/maven-plugin/WEB-INF/lib/maven-interceptor-1.2.jar 33639 /llocal/dhis/jenkins_home/plugins/maven-plugin/WEB-INF/lib/maven2.1-interceptor-1.2.jar
<===[HUDSON REMOTING CAPACITY]===> channel started
Executing Maven: -B -f <http://dhis.uio.no/ci/job/Dhis2%20Web%20Trunk/ws/dhis-2/dhis-web/pom.xml> clean install findbugs:findbugs
[INFO] Scanning for projects...
[INFO] Reactor build order:
[INFO] DHIS Web Modules Project
[INFO] DHIS Common Functionality for Web
[INFO] DHIS Common Resources for Web
[INFO] DHIS Web Modules Maintenance
[INFO] DHIS Data Set Management
[INFO] DHIS Data Dictionary
[INFO] DHIS Organisation Unit Management
[INFO] DHIS Setting Maintenance
[INFO] DHIS User Maintenance
[INFO] DHIS Data Administration
[INFO] DHIS Patient Management
[INFO] DHIS Data Entry
[INFO] DHIS Import-Export
[INFO] DHIS Data Mart
[INFO] DHIS Validation Rule
[INFO] DHIS Web Reporting
[INFO] DHIS Mapping
[INFO] DHIS Web Dashboard Integration module
[INFO] DHIS Case Entry
[INFO] DHIS Web API
[INFO] DHIS Web Light
[INFO] DHIS Web Portal
[INFO] ------------------------------------------------------------------------
[INFO] Building DHIS Web Modules Project
[INFO] task-segment: [clean, install, findbugs:findbugs]
[INFO] ------------------------------------------------------------------------
[INFO] [clean:clean {execution: default-clean}]
[INFO] [site:attach-descriptor {execution: default-attach-descriptor}]
[INFO] [install:install {execution: default-install}]
[INFO] Installing <http://dhis.uio.no/ci/job/Dhis2%20Web%20Trunk/ws/dhis-2/dhis-web/pom.xml> to /ifi/utgard/p01/dhis/.m2/repository/org/hisp/dhis/dhis-web/2.4-SNAPSHOT/dhis-web-2.4-SNAPSHOT.pom
[WARNING] DEPRECATED [findbugsXmlOutput]: No reason given
[INFO] [findbugs:findbugs {execution: default-cli}]
[INFO] ****** FindBugsMojo execute *******
[INFO] canGenerate is false
[FINDBUGS] Using set difference to compute new warnings
[FINDBUGS] Not changing build status, since no threshold has been exceeded
[JENKINS] Archiving <http://dhis.uio.no/ci/job/Dhis2%20Web%20Trunk/ws/dhis-2/dhis-web/pom.xml> to /llocal/dhis/jenkins_home/jobs/Dhis2 Web Trunk/modules/org.hisp.dhis$dhis-web/builds/2011-07-20_12-10-37/archive/org.hisp.dhis/dhis-web/2.4-SNAPSHOT/dhis-web-2.4-SNAPSHOT.pom
[INFO] ------------------------------------------------------------------------
[INFO] Building DHIS Common Functionality for Web
[INFO] task-segment: [clean, install, findbugs:findbugs]
[INFO] ------------------------------------------------------------------------
[INFO] [clean:clean {execution: default-clean}]
[JENKINS] Archiving <http://dhis.uio.no/ci/job/Dhis2%20Web%20Trunk/ws/dhis-2/dhis-web/dhis-web-commons/pom.xml> to /llocal/dhis/jenkins_home/jobs/Dhis2 Web Trunk/modules/org.hisp.dhis$dhis-web-commons/builds/2011-07-20_12-10-37/archive/org.hisp.dhis/dhis-web-commons/2.4-SNAPSHOT/dhis-web-commons-2.4-SNAPSHOT.pom
[INFO] ------------------------------------------------------------------------
[ERROR] BUILD ERROR
[INFO] ------------------------------------------------------------------------
[INFO] Error building POM (may not be this project's POM).

Project ID: org.hisp.dhis:dhis-api

Reason: Error getting POM for 'org.hisp.dhis:dhis-api' from the repository: Unable to read local copy of metadata: Cannot read metadata from '/ifi/utgard/p01/dhis/.m2/repository/org/hisp/dhis/dhis-api/2.4-SNAPSHOT/maven-metadata-amplecode_maven2_repo.xml': end tag name </head> must be the same as start tag <link> from line 6 (position: TEXT seen ...e="text/css" rel="stylesheet" href="/static/styles.css">\n </head>... @7:10)
  org.hisp.dhis:dhis-api:pom:2.4-SNAPSHOT

for project org.hisp.dhis:dhis-api

[INFO] ------------------------------------------------------------------------
[INFO] For more information, run Maven with the -e switch
[INFO] ------------------------------------------------------------------------
[INFO] Total time: 9 seconds
[INFO] Finished at: Wed Jul 20 12:10:52 CEST 2011
[INFO] Final Memory: 40M/407M
[INFO] ------------------------------------------------------------------------
[FINDBUGS] Aggregating results of DHIS Web Modules Project
[FINDBUGS] Using set difference to compute new warnings
[FINDBUGS] Not changing build status, since no threshold has been exceeded
channel stopped
Archiving artifacts
ERROR: Ignore Problem expanding maven opts macros org.jenkinsci.plugins.tokenmacro.TokenMacro
Performing Post build task...
Could not match :DHIS Web Portal ....................................... SUCCESS : False
Logical operation result is FALSE
Skipping script : /ifi/utgard/p01/dhis/bin/ci/trunk.sh

END OF POST BUILD TASK : 0

See <http://dhis.uio.no/ci/job/Dhis2%20Web%20Trunk/2905/changes>

Changes:

[Tran Chau] Minor fix.

[Hieu] Reporting module - Fixed unit tests building failed.

[Tran Chau] Ajax Request stuff don't work does not work with IE9 ( Patient module ).

···

------------------------------------------
Started by upstream project "Dhis2 Service Trunk" build number 3026
ERROR: Ignore Problem expanding maven opts macros org.jenkinsci.plugins.tokenmacro.TokenMacro
Deleting old artifacts from #2903
Parsing POMs
ERROR: Ignore Problem expanding maven opts macros org.jenkinsci.plugins.tokenmacro.TokenMacro
[dhis-web] $ /local/opt/j2sdk/bin/java -Xmx1024m -XX:MaxPermSize=512m -cp /llocal/dhis/jenkins_home/plugins/maven-plugin/WEB-INF/lib/maven-agent-1.2.jar:/llocal/dhis/jenkins_home/tools/2.2.1/boot/classworlds-1.1.jar hudson.maven.agent.Main /llocal/dhis/jenkins_home/tools/2.2.1 /ifi/utgard/p01/dhis/projects/dhis-1.ifi.uio.no/ci/tomcat/webapps/ci/WEB-INF/lib/remoting-1.417.jar /llocal/dhis/jenkins_home/plugins/maven-plugin/WEB-INF/lib/maven-interceptor-1.2.jar 45655 /llocal/dhis/jenkins_home/plugins/maven-plugin/WEB-INF/lib/maven2.1-interceptor-1.2.jar
<===[HUDSON REMOTING CAPACITY]===> channel started
Executing Maven: -B -f <http://dhis.uio.no/ci/job/Dhis2%20Web%20Trunk/ws/dhis-2/dhis-web/pom.xml> clean install findbugs:findbugs
[INFO] Scanning for projects...
[INFO] Reactor build order:
[INFO] DHIS Web Modules Project
[INFO] DHIS Common Functionality for Web
[INFO] DHIS Common Resources for Web
[INFO] DHIS Web Modules Maintenance
[INFO] DHIS Data Set Management
[INFO] DHIS Data Dictionary
[INFO] DHIS Organisation Unit Management
[INFO] DHIS Setting Maintenance
[INFO] DHIS User Maintenance
[INFO] DHIS Data Administration
[INFO] DHIS Patient Management
[INFO] DHIS Data Entry
[INFO] DHIS Import-Export
[INFO] DHIS Data Mart
[INFO] DHIS Validation Rule
[INFO] DHIS Web Reporting
[INFO] DHIS Mapping
[INFO] DHIS Web Dashboard Integration module
[INFO] DHIS Case Entry
[INFO] DHIS Web API
[INFO] DHIS Web Light
[INFO] DHIS Web Portal
[INFO] ------------------------------------------------------------------------
[INFO] Building DHIS Web Modules Project
[INFO] task-segment: [clean, install, findbugs:findbugs]
[INFO] ------------------------------------------------------------------------
[INFO] [clean:clean {execution: default-clean}]
[INFO] [site:attach-descriptor {execution: default-attach-descriptor}]
[INFO] [install:install {execution: default-install}]
[INFO] Installing <http://dhis.uio.no/ci/job/Dhis2%20Web%20Trunk/ws/dhis-2/dhis-web/pom.xml> to /ifi/utgard/p01/dhis/.m2/repository/org/hisp/dhis/dhis-web/2.4-SNAPSHOT/dhis-web-2.4-SNAPSHOT.pom
[WARNING] DEPRECATED [findbugsXmlOutput]: No reason given
[INFO] [findbugs:findbugs {execution: default-cli}]
[INFO] ****** FindBugsMojo execute *******
[INFO] canGenerate is false
[FINDBUGS] Using set difference to compute new warnings
[FINDBUGS] Not changing build status, since no threshold has been exceeded
[JENKINS] Archiving <http://dhis.uio.no/ci/job/Dhis2%20Web%20Trunk/ws/dhis-2/dhis-web/pom.xml> to /llocal/dhis/jenkins_home/jobs/Dhis2 Web Trunk/modules/org.hisp.dhis$dhis-web/builds/2011-07-22_07-10-44/archive/org.hisp.dhis/dhis-web/2.4-SNAPSHOT/dhis-web-2.4-SNAPSHOT.pom
[INFO] ------------------------------------------------------------------------
[INFO] Building DHIS Common Functionality for Web
[INFO] task-segment: [clean, install, findbugs:findbugs]
[INFO] ------------------------------------------------------------------------
[INFO] [clean:clean {execution: default-clean}]
[JENKINS] Archiving <http://dhis.uio.no/ci/job/Dhis2%20Web%20Trunk/ws/dhis-2/dhis-web/dhis-web-commons/pom.xml> to /llocal/dhis/jenkins_home/jobs/Dhis2 Web Trunk/modules/org.hisp.dhis$dhis-web-commons/builds/2011-07-22_07-10-44/archive/org.hisp.dhis/dhis-web-commons/2.4-SNAPSHOT/dhis-web-commons-2.4-SNAPSHOT.pom
[INFO] ------------------------------------------------------------------------
[ERROR] BUILD ERROR
[INFO] ------------------------------------------------------------------------
[INFO] Error building POM (may not be this project's POM).

Project ID: org.hisp.dhis:dhis-api

Reason: Error getting POM for 'org.hisp.dhis:dhis-api' from the repository: Unable to read local copy of metadata: Cannot read metadata from '/ifi/utgard/p01/dhis/.m2/repository/org/hisp/dhis/dhis-api/2.4-SNAPSHOT/maven-metadata-amplecode_maven2_repo.xml': end tag name </head> must be the same as start tag <link> from line 6 (position: TEXT seen ...e="text/css" rel="stylesheet" href="/static/styles.css">\n </head>... @7:10)
  org.hisp.dhis:dhis-api:pom:2.4-SNAPSHOT

for project org.hisp.dhis:dhis-api

[INFO] ------------------------------------------------------------------------
[INFO] For more information, run Maven with the -e switch
[INFO] ------------------------------------------------------------------------
[INFO] Total time: 9 seconds
[INFO] Finished at: Fri Jul 22 07:10:59 CEST 2011
[INFO] Final Memory: 40M/407M
[INFO] ------------------------------------------------------------------------
[FINDBUGS] Aggregating results of DHIS Web Modules Project
[FINDBUGS] Using set difference to compute new warnings
[FINDBUGS] Not changing build status, since no threshold has been exceeded
channel stopped
Archiving artifacts
ERROR: Ignore Problem expanding maven opts macros org.jenkinsci.plugins.tokenmacro.TokenMacro
Performing Post build task...
Could not match :DHIS Web Portal ....................................... SUCCESS : False
Logical operation result is FALSE
Skipping script : /ifi/utgard/p01/dhis/bin/ci/trunk.sh

END OF POST BUILD TASK : 0

See <http://dhis.uio.no/ci/job/Dhis2%20Web%20Trunk/2906/changes>

Changes:

[Hieu] Fixed deletion handler for ReportTableGroup. And finished the common GUI for ChartGroup, ReportGroup and ReportTableGroup.

···

------------------------------------------
Started by upstream project "Dhis2 Service Trunk" build number 3027
ERROR: Ignore Problem expanding maven opts macros org.jenkinsci.plugins.tokenmacro.TokenMacro
Deleting old artifacts from #2904
Parsing POMs
ERROR: Ignore Problem expanding maven opts macros org.jenkinsci.plugins.tokenmacro.TokenMacro
[dhis-web] $ /local/opt/j2sdk/bin/java -Xmx1024m -XX:MaxPermSize=512m -cp /llocal/dhis/jenkins_home/plugins/maven-plugin/WEB-INF/lib/maven-agent-1.2.jar:/llocal/dhis/jenkins_home/tools/2.2.1/boot/classworlds-1.1.jar hudson.maven.agent.Main /llocal/dhis/jenkins_home/tools/2.2.1 /ifi/utgard/p01/dhis/projects/dhis-1.ifi.uio.no/ci/tomcat/webapps/ci/WEB-INF/lib/remoting-1.417.jar /llocal/dhis/jenkins_home/plugins/maven-plugin/WEB-INF/lib/maven-interceptor-1.2.jar 48178 /llocal/dhis/jenkins_home/plugins/maven-plugin/WEB-INF/lib/maven2.1-interceptor-1.2.jar
<===[HUDSON REMOTING CAPACITY]===> channel started
Executing Maven: -B -f <http://dhis.uio.no/ci/job/Dhis2%20Web%20Trunk/ws/dhis-2/dhis-web/pom.xml> clean install findbugs:findbugs
[INFO] Scanning for projects...
[INFO] Reactor build order:
[INFO] DHIS Web Modules Project
[INFO] DHIS Common Functionality for Web
[INFO] DHIS Common Resources for Web
[INFO] DHIS Web Modules Maintenance
[INFO] DHIS Data Set Management
[INFO] DHIS Data Dictionary
[INFO] DHIS Organisation Unit Management
[INFO] DHIS Setting Maintenance
[INFO] DHIS User Maintenance
[INFO] DHIS Data Administration
[INFO] DHIS Patient Management
[INFO] DHIS Data Entry
[INFO] DHIS Import-Export
[INFO] DHIS Data Mart
[INFO] DHIS Validation Rule
[INFO] DHIS Web Reporting
[INFO] DHIS Mapping
[INFO] DHIS Web Dashboard Integration module
[INFO] DHIS Case Entry
[INFO] DHIS Web API
[INFO] DHIS Web Light
[INFO] DHIS Web Portal
[INFO] ------------------------------------------------------------------------
[INFO] Building DHIS Web Modules Project
[INFO] task-segment: [clean, install, findbugs:findbugs]
[INFO] ------------------------------------------------------------------------
[INFO] [clean:clean {execution: default-clean}]
[INFO] [site:attach-descriptor {execution: default-attach-descriptor}]
[INFO] [install:install {execution: default-install}]
[INFO] Installing <http://dhis.uio.no/ci/job/Dhis2%20Web%20Trunk/ws/dhis-2/dhis-web/pom.xml> to /ifi/utgard/p01/dhis/.m2/repository/org/hisp/dhis/dhis-web/2.4-SNAPSHOT/dhis-web-2.4-SNAPSHOT.pom
[WARNING] DEPRECATED [findbugsXmlOutput]: No reason given
[INFO] [findbugs:findbugs {execution: default-cli}]
[INFO] ****** FindBugsMojo execute *******
[INFO] canGenerate is false
[FINDBUGS] Using set difference to compute new warnings
[FINDBUGS] Not changing build status, since no threshold has been exceeded
[JENKINS] Archiving <http://dhis.uio.no/ci/job/Dhis2%20Web%20Trunk/ws/dhis-2/dhis-web/pom.xml> to /llocal/dhis/jenkins_home/jobs/Dhis2 Web Trunk/modules/org.hisp.dhis$dhis-web/builds/2011-07-22_10-10-38/archive/org.hisp.dhis/dhis-web/2.4-SNAPSHOT/dhis-web-2.4-SNAPSHOT.pom
[INFO] ------------------------------------------------------------------------
[INFO] Building DHIS Common Functionality for Web
[INFO] task-segment: [clean, install, findbugs:findbugs]
[INFO] ------------------------------------------------------------------------
[INFO] [clean:clean {execution: default-clean}]
[JENKINS] Archiving <http://dhis.uio.no/ci/job/Dhis2%20Web%20Trunk/ws/dhis-2/dhis-web/dhis-web-commons/pom.xml> to /llocal/dhis/jenkins_home/jobs/Dhis2 Web Trunk/modules/org.hisp.dhis$dhis-web-commons/builds/2011-07-22_10-10-38/archive/org.hisp.dhis/dhis-web-commons/2.4-SNAPSHOT/dhis-web-commons-2.4-SNAPSHOT.pom
[INFO] ------------------------------------------------------------------------
[ERROR] BUILD ERROR
[INFO] ------------------------------------------------------------------------
[INFO] Error building POM (may not be this project's POM).

Project ID: org.hisp.dhis:dhis-api

Reason: Error getting POM for 'org.hisp.dhis:dhis-api' from the repository: Unable to read local copy of metadata: Cannot read metadata from '/ifi/utgard/p01/dhis/.m2/repository/org/hisp/dhis/dhis-api/2.4-SNAPSHOT/maven-metadata-amplecode_maven2_repo.xml': end tag name </head> must be the same as start tag <link> from line 6 (position: TEXT seen ...e="text/css" rel="stylesheet" href="/static/styles.css">\n </head>... @7:10)
  org.hisp.dhis:dhis-api:pom:2.4-SNAPSHOT

for project org.hisp.dhis:dhis-api

[INFO] ------------------------------------------------------------------------
[INFO] For more information, run Maven with the -e switch
[INFO] ------------------------------------------------------------------------
[INFO] Total time: 9 seconds
[INFO] Finished at: Fri Jul 22 10:10:53 CEST 2011
[INFO] Final Memory: 40M/407M
[INFO] ------------------------------------------------------------------------
[FINDBUGS] Aggregating results of DHIS Web Modules Project
[FINDBUGS] Using set difference to compute new warnings
[FINDBUGS] Not changing build status, since no threshold has been exceeded
channel stopped
Archiving artifacts
ERROR: Ignore Problem expanding maven opts macros org.jenkinsci.plugins.tokenmacro.TokenMacro
Performing Post build task...
Could not match :DHIS Web Portal ....................................... SUCCESS : False
Logical operation result is FALSE
Skipping script : /ifi/utgard/p01/dhis/bin/ci/trunk.sh

END OF POST BUILD TASK : 0

See <http://dhis.uio.no/ci/job/Dhis2%20Web%20Trunk/2907/changes>

Changes:

[Lars Helge Overland] Put a date picker heading for input fields for date dataelements in dataentry

···

------------------------------------------
Started by upstream project "Dhis2 Service Trunk" build number 3028
ERROR: Ignore Problem expanding maven opts macros org.jenkinsci.plugins.tokenmacro.TokenMacro
Deleting old artifacts from #2905
Parsing POMs
ERROR: Ignore Problem expanding maven opts macros org.jenkinsci.plugins.tokenmacro.TokenMacro
[dhis-web] $ /local/opt/j2sdk/bin/java -Xmx1024m -XX:MaxPermSize=512m -cp /llocal/dhis/jenkins_home/plugins/maven-plugin/WEB-INF/lib/maven-agent-1.2.jar:/llocal/dhis/jenkins_home/tools/2.2.1/boot/classworlds-1.1.jar hudson.maven.agent.Main /llocal/dhis/jenkins_home/tools/2.2.1 /ifi/utgard/p01/dhis/projects/dhis-1.ifi.uio.no/ci/tomcat/webapps/ci/WEB-INF/lib/remoting-1.417.jar /llocal/dhis/jenkins_home/plugins/maven-plugin/WEB-INF/lib/maven-interceptor-1.2.jar 53675 /llocal/dhis/jenkins_home/plugins/maven-plugin/WEB-INF/lib/maven2.1-interceptor-1.2.jar
<===[HUDSON REMOTING CAPACITY]===> channel started
Executing Maven: -B -f <http://dhis.uio.no/ci/job/Dhis2%20Web%20Trunk/ws/dhis-2/dhis-web/pom.xml> clean install findbugs:findbugs
[INFO] Scanning for projects...
[INFO] Reactor build order:
[INFO] DHIS Web Modules Project
[INFO] DHIS Common Functionality for Web
[INFO] DHIS Common Resources for Web
[INFO] DHIS Web Modules Maintenance
[INFO] DHIS Data Set Management
[INFO] DHIS Data Dictionary
[INFO] DHIS Organisation Unit Management
[INFO] DHIS Setting Maintenance
[INFO] DHIS User Maintenance
[INFO] DHIS Data Administration
[INFO] DHIS Patient Management
[INFO] DHIS Data Entry
[INFO] DHIS Import-Export
[INFO] DHIS Data Mart
[INFO] DHIS Validation Rule
[INFO] DHIS Web Reporting
[INFO] DHIS Mapping
[INFO] DHIS Web Dashboard Integration module
[INFO] DHIS Case Entry
[INFO] DHIS Web API
[INFO] DHIS Web Light
[INFO] DHIS Web Portal
[INFO] ------------------------------------------------------------------------
[INFO] Building DHIS Web Modules Project
[INFO] task-segment: [clean, install, findbugs:findbugs]
[INFO] ------------------------------------------------------------------------
[INFO] [clean:clean {execution: default-clean}]
[INFO] [site:attach-descriptor {execution: default-attach-descriptor}]
[INFO] [install:install {execution: default-install}]
[INFO] Installing <http://dhis.uio.no/ci/job/Dhis2%20Web%20Trunk/ws/dhis-2/dhis-web/pom.xml> to /ifi/utgard/p01/dhis/.m2/repository/org/hisp/dhis/dhis-web/2.4-SNAPSHOT/dhis-web-2.4-SNAPSHOT.pom
[WARNING] DEPRECATED [findbugsXmlOutput]: No reason given
[INFO] [findbugs:findbugs {execution: default-cli}]
[INFO] ****** FindBugsMojo execute *******
[INFO] canGenerate is false
[FINDBUGS] Using set difference to compute new warnings
[FINDBUGS] Not changing build status, since no threshold has been exceeded
[JENKINS] Archiving <http://dhis.uio.no/ci/job/Dhis2%20Web%20Trunk/ws/dhis-2/dhis-web/pom.xml> to /llocal/dhis/jenkins_home/jobs/Dhis2 Web Trunk/modules/org.hisp.dhis$dhis-web/builds/2011-07-22_11-10-30/archive/org.hisp.dhis/dhis-web/2.4-SNAPSHOT/dhis-web-2.4-SNAPSHOT.pom
[INFO] ------------------------------------------------------------------------
[INFO] Building DHIS Common Functionality for Web
[INFO] task-segment: [clean, install, findbugs:findbugs]
[INFO] ------------------------------------------------------------------------
[INFO] [clean:clean {execution: default-clean}]
[JENKINS] Archiving <http://dhis.uio.no/ci/job/Dhis2%20Web%20Trunk/ws/dhis-2/dhis-web/dhis-web-commons/pom.xml> to /llocal/dhis/jenkins_home/jobs/Dhis2 Web Trunk/modules/org.hisp.dhis$dhis-web-commons/builds/2011-07-22_11-10-30/archive/org.hisp.dhis/dhis-web-commons/2.4-SNAPSHOT/dhis-web-commons-2.4-SNAPSHOT.pom
[INFO] ------------------------------------------------------------------------
[ERROR] BUILD ERROR
[INFO] ------------------------------------------------------------------------
[INFO] Error building POM (may not be this project's POM).

Project ID: org.hisp.dhis:dhis-api

Reason: Error getting POM for 'org.hisp.dhis:dhis-api' from the repository: Unable to read local copy of metadata: Cannot read metadata from '/ifi/utgard/p01/dhis/.m2/repository/org/hisp/dhis/dhis-api/2.4-SNAPSHOT/maven-metadata-amplecode_maven2_repo.xml': end tag name </head> must be the same as start tag <link> from line 6 (position: TEXT seen ...e="text/css" rel="stylesheet" href="/static/styles.css">\n </head>... @7:10)
  org.hisp.dhis:dhis-api:pom:2.4-SNAPSHOT

for project org.hisp.dhis:dhis-api

[INFO] ------------------------------------------------------------------------
[INFO] For more information, run Maven with the -e switch
[INFO] ------------------------------------------------------------------------
[INFO] Total time: 9 seconds
[INFO] Finished at: Fri Jul 22 11:10:45 CEST 2011
[INFO] Final Memory: 40M/408M
[INFO] ------------------------------------------------------------------------
[FINDBUGS] Aggregating results of DHIS Web Modules Project
[FINDBUGS] Using set difference to compute new warnings
[FINDBUGS] Not changing build status, since no threshold has been exceeded
channel stopped
Archiving artifacts
ERROR: Ignore Problem expanding maven opts macros org.jenkinsci.plugins.tokenmacro.TokenMacro
Performing Post build task...
Could not match :DHIS Web Portal ....................................... SUCCESS : False
Logical operation result is FALSE
Skipping script : /ifi/utgard/p01/dhis/bin/ci/trunk.sh

END OF POST BUILD TASK : 0

See <http://dhis.uio.no/ci/job/Dhis2%20Web%20Trunk/2908/changes>

Changes:

[Hieu] local vn - Fixed bug show data entry status.

[Lars Helge Overland] Using json rather than xml for a few actions in ouwt and oust

···

------------------------------------------
Started by upstream project "Dhis2 Service Trunk" build number 3029
ERROR: Ignore Problem expanding maven opts macros org.jenkinsci.plugins.tokenmacro.TokenMacro
Deleting old artifacts from #2906
Parsing POMs
ERROR: Ignore Problem expanding maven opts macros org.jenkinsci.plugins.tokenmacro.TokenMacro
[dhis-web] $ /local/opt/j2sdk/bin/java -Xmx1024m -XX:MaxPermSize=512m -cp /llocal/dhis/jenkins_home/plugins/maven-plugin/WEB-INF/lib/maven-agent-1.2.jar:/llocal/dhis/jenkins_home/tools/2.2.1/boot/classworlds-1.1.jar hudson.maven.agent.Main /llocal/dhis/jenkins_home/tools/2.2.1 /ifi/utgard/p01/dhis/projects/dhis-1.ifi.uio.no/ci/tomcat/webapps/ci/WEB-INF/lib/remoting-1.417.jar /llocal/dhis/jenkins_home/plugins/maven-plugin/WEB-INF/lib/maven-interceptor-1.2.jar 57108 /llocal/dhis/jenkins_home/plugins/maven-plugin/WEB-INF/lib/maven2.1-interceptor-1.2.jar
<===[HUDSON REMOTING CAPACITY]===> channel started
Executing Maven: -B -f <http://dhis.uio.no/ci/job/Dhis2%20Web%20Trunk/ws/dhis-2/dhis-web/pom.xml> clean install findbugs:findbugs
[INFO] Scanning for projects...
[INFO] Reactor build order:
[INFO] DHIS Web Modules Project
[INFO] DHIS Common Functionality for Web
[INFO] DHIS Common Resources for Web
[INFO] DHIS Web Modules Maintenance
[INFO] DHIS Data Set Management
[INFO] DHIS Data Dictionary
[INFO] DHIS Organisation Unit Management
[INFO] DHIS Setting Maintenance
[INFO] DHIS User Maintenance
[INFO] DHIS Data Administration
[INFO] DHIS Patient Management
[INFO] DHIS Data Entry
[INFO] DHIS Import-Export
[INFO] DHIS Data Mart
[INFO] DHIS Validation Rule
[INFO] DHIS Web Reporting
[INFO] DHIS Mapping
[INFO] DHIS Web Dashboard Integration module
[INFO] DHIS Case Entry
[INFO] DHIS Web API
[INFO] DHIS Web Light
[INFO] DHIS Web Portal
[INFO] ------------------------------------------------------------------------
[INFO] Building DHIS Web Modules Project
[INFO] task-segment: [clean, install, findbugs:findbugs]
[INFO] ------------------------------------------------------------------------
[INFO] [clean:clean {execution: default-clean}]
[INFO] [site:attach-descriptor {execution: default-attach-descriptor}]
[INFO] [install:install {execution: default-install}]
[INFO] Installing <http://dhis.uio.no/ci/job/Dhis2%20Web%20Trunk/ws/dhis-2/dhis-web/pom.xml> to /ifi/utgard/p01/dhis/.m2/repository/org/hisp/dhis/dhis-web/2.4-SNAPSHOT/dhis-web-2.4-SNAPSHOT.pom
[WARNING] DEPRECATED [findbugsXmlOutput]: No reason given
[INFO] [findbugs:findbugs {execution: default-cli}]
[INFO] ****** FindBugsMojo execute *******
[INFO] canGenerate is false
[FINDBUGS] Using set difference to compute new warnings
[FINDBUGS] Not changing build status, since no threshold has been exceeded
[JENKINS] Archiving <http://dhis.uio.no/ci/job/Dhis2%20Web%20Trunk/ws/dhis-2/dhis-web/pom.xml> to /llocal/dhis/jenkins_home/jobs/Dhis2 Web Trunk/modules/org.hisp.dhis$dhis-web/builds/2011-07-22_12-10-42/archive/org.hisp.dhis/dhis-web/2.4-SNAPSHOT/dhis-web-2.4-SNAPSHOT.pom
[INFO] ------------------------------------------------------------------------
[INFO] Building DHIS Common Functionality for Web
[INFO] task-segment: [clean, install, findbugs:findbugs]
[INFO] ------------------------------------------------------------------------
[INFO] [clean:clean {execution: default-clean}]
[JENKINS] Archiving <http://dhis.uio.no/ci/job/Dhis2%20Web%20Trunk/ws/dhis-2/dhis-web/dhis-web-commons/pom.xml> to /llocal/dhis/jenkins_home/jobs/Dhis2 Web Trunk/modules/org.hisp.dhis$dhis-web-commons/builds/2011-07-22_12-10-42/archive/org.hisp.dhis/dhis-web-commons/2.4-SNAPSHOT/dhis-web-commons-2.4-SNAPSHOT.pom
[INFO] ------------------------------------------------------------------------
[ERROR] BUILD ERROR
[INFO] ------------------------------------------------------------------------
[INFO] Error building POM (may not be this project's POM).

Project ID: org.hisp.dhis:dhis-api

Reason: Error getting POM for 'org.hisp.dhis:dhis-api' from the repository: Unable to read local copy of metadata: Cannot read metadata from '/ifi/utgard/p01/dhis/.m2/repository/org/hisp/dhis/dhis-api/2.4-SNAPSHOT/maven-metadata-amplecode_maven2_repo.xml': end tag name </head> must be the same as start tag <link> from line 6 (position: TEXT seen ...e="text/css" rel="stylesheet" href="/static/styles.css">\n </head>... @7:10)
  org.hisp.dhis:dhis-api:pom:2.4-SNAPSHOT

for project org.hisp.dhis:dhis-api

[INFO] ------------------------------------------------------------------------
[INFO] For more information, run Maven with the -e switch
[INFO] ------------------------------------------------------------------------
[INFO] Total time: 8 seconds
[INFO] Finished at: Fri Jul 22 12:10:57 CEST 2011
[INFO] Final Memory: 40M/407M
[INFO] ------------------------------------------------------------------------
[FINDBUGS] Aggregating results of DHIS Web Modules Project
[FINDBUGS] Using set difference to compute new warnings
[FINDBUGS] Not changing build status, since no threshold has been exceeded
channel stopped
Archiving artifacts
ERROR: Ignore Problem expanding maven opts macros org.jenkinsci.plugins.tokenmacro.TokenMacro
Performing Post build task...
Could not match :DHIS Web Portal ....................................... SUCCESS : False
Logical operation result is FALSE
Skipping script : /ifi/utgard/p01/dhis/bin/ci/trunk.sh

END OF POST BUILD TASK : 0