Build failed in Jenkins: Dhis2 Web Trunk #2359

See <http://dhis.uio.no/ci/job/Dhis2%20Web%20Trunk/2359/changes>

Changes:

[Tran Chau] Fix bug: Don't search patients by full-name and attribute-value.

···

------------------------------------------
[...truncated 837 lines...]
[INFO] Building war: <http://dhis.uio.no/ci/job/Dhis2%20Web%20Trunk/ws/dhis-2/dhis-web/dhis-web-validationrule/target/dhis-web-validationrule.war>
[INFO] [install:install {execution: default-install}]
[INFO] Installing <http://dhis.uio.no/ci/job/Dhis2%20Web%20Trunk/ws/dhis-2/dhis-web/dhis-web-validationrule/target/dhis-web-validationrule.war> to /ifi/utgard/p01/dhis/.m2/repository/org/hisp/dhis/dhis-web-validationrule/2.2-SNAPSHOT/dhis-web-validationrule-2.2-SNAPSHOT.war
[INFO] Preparing findbugs:findbugs
[JENKINS] Archiving <http://dhis.uio.no/ci/job/Dhis2%20Web%20Trunk/ws/dhis-2/dhis-web/dhis-web-validationrule/pom.xml> to /projects/hisp/jenkins_home/jobs/Dhis2 Web Trunk/modules/org.hisp.dhis$dhis-web-validationrule/builds/2011-04-07_10-47-55/archive/org.hisp.dhis/dhis-web-validationrule/2.2-SNAPSHOT/dhis-web-validationrule-2.2-SNAPSHOT.pom
[JENKINS] Archiving <http://dhis.uio.no/ci/job/Dhis2%20Web%20Trunk/ws/dhis-2/dhis-web/dhis-web-validationrule/target/dhis-web-validationrule.war> to /projects/hisp/jenkins_home/jobs/Dhis2 Web Trunk/modules/org.hisp.dhis$dhis-web-validationrule/builds/2011-04-07_10-47-55/archive/org.hisp.dhis/dhis-web-validationrule/2.2-SNAPSHOT/dhis-web-validationrule-2.2-SNAPSHOT.war
[INFO] [resources:resources {execution: default-resources}]
[INFO] Using encoding: 'UTF-8' to copy filtered resources.
[INFO] [compiler:compile {execution: default-compile}]
[INFO] Nothing to compile - all classes are up to date
[INFO] [findbugs:findbugs {execution: default-cli}]
[INFO] Using source root:
[INFO] <http://dhis.uio.no/ci/job/Dhis2%20Web%20Trunk/ws/dhis-2/dhis-web/dhis-web-validationrule/target/classes>
[INFO] Using test source root:
[INFO] <http://dhis.uio.no/ci/job/Dhis2%20Web%20Trunk/ws/dhis-2/dhis-web/dhis-web-validationrule/target/test-classes>
[INFO] No effort provided, using default effort.
[INFO] Adding Source Directory: <http://dhis.uio.no/ci/job/Dhis2%20Web%20Trunk/ws/dhis-2/dhis-web/dhis-web-validationrule/src/main/java>
[INFO] No threshold provided, using default threshold.
[INFO] Using FindBugs Version: 1.3.8
[INFO] No threshold provided, using default threshold.
[INFO] No threshold provided, using default threshold.
[INFO] No threshold provided, using default threshold.
[INFO] Using the xdoc format
[INFO] No effort provided, using default effort.
[INFO] No threshold provided, using default threshold.
[INFO] No threshold provided, using default threshold.
[INFO] Debugging is Off
[INFO] No bug include filter.
[INFO] Using bug exclude filter /tmp/plexus-resources1858621173tmp
[INFO] Printing Errors
[INFO] Printing Missing classes
[INFO] Printing Source Roots
[FINDBUGS] Successfully parsed file <http://dhis.uio.no/ci/job/Dhis2%20Web%20Trunk/ws/dhis-2/dhis-web/dhis-web-validationrule/target/findbugsXml.xml> of module DHIS Validation Rule with 42 warnings.
[INFO] ------------------------------------------------------------------------
[INFO] Building DHIS Web Reporting
[INFO] task-segment: [clean, install, findbugs:findbugs]
[INFO] ------------------------------------------------------------------------
[INFO] [clean:clean {execution: default-clean}]
[INFO] Deleting directory <http://dhis.uio.no/ci/job/Dhis2%20Web%20Trunk/ws/dhis-2/dhis-web/dhis-web-reporting/target>
[INFO] [resources:resources {execution: default-resources}]
[INFO] Using encoding: 'UTF-8' to copy filtered resources.
[INFO] [compiler:compile {execution: default-compile}]
[INFO] Compiling 54 source files to <http://dhis.uio.no/ci/job/Dhis2%20Web%20Trunk/ws/dhis-2/dhis-web/dhis-web-reporting/target/classes>
[INFO] [resources:testResources {execution: default-testResources}]
[INFO] Using encoding: 'UTF-8' to copy filtered resources.
[INFO] [compiler:testCompile {execution: default-testCompile}]
[INFO] No sources to compile
[INFO] [surefire:test {execution: default-test}]
[INFO] No tests to run.
[JENKINS] Recording test results
[INFO] [war:war {execution: default-war}]
[INFO] Exploding webapp...
[INFO] Assembling webapp dhis-web-reporting in <http://dhis.uio.no/ci/job/Dhis2%20Web%20Trunk/ws/dhis-2/dhis-web/dhis-web-reporting/target/dhis-web-reporting>
[INFO] Copy webapp webResources to <http://dhis.uio.no/ci/job/Dhis2%20Web%20Trunk/ws/dhis-2/dhis-web/dhis-web-reporting/target/dhis-web-reporting>
[INFO] Building jar: <http://dhis.uio.no/ci/job/Dhis2%20Web%20Trunk/ws/dhis-2/dhis-web/dhis-web-reporting/target/dhis-web-reporting/WEB-INF/lib/dhis-web-reporting.jar>
[INFO] Expanding: <http://dhis.uio.no/ci/job/Dhis2%20Web%20Trunk/ws/dhis-2/dhis-web/dhis-web-commons-resources/target/dhis-web-commons-resources-2.2-SNAPSHOT.war> into <http://dhis.uio.no/ci/job/Dhis2%20Web%20Trunk/ws/dhis-2/dhis-web/dhis-web-reporting/target/war/work/dhis-web-commons-resources-2.2-SNAPSHOT>
[INFO] Overlaying 1 war(s).
[INFO] Generating war <http://dhis.uio.no/ci/job/Dhis2%20Web%20Trunk/ws/dhis-2/dhis-web/dhis-web-reporting/target/dhis-web-reporting.war>
[INFO] Building war: <http://dhis.uio.no/ci/job/Dhis2%20Web%20Trunk/ws/dhis-2/dhis-web/dhis-web-reporting/target/dhis-web-reporting.war>
[INFO] [install:install {execution: default-install}]
[INFO] Installing <http://dhis.uio.no/ci/job/Dhis2%20Web%20Trunk/ws/dhis-2/dhis-web/dhis-web-reporting/target/dhis-web-reporting.war> to /ifi/utgard/p01/dhis/.m2/repository/org/hisp/dhis/dhis-web-reporting/2.2-SNAPSHOT/dhis-web-reporting-2.2-SNAPSHOT.war
[INFO] Preparing findbugs:findbugs
[JENKINS] Archiving <http://dhis.uio.no/ci/job/Dhis2%20Web%20Trunk/ws/dhis-2/dhis-web/dhis-web-reporting/pom.xml> to /projects/hisp/jenkins_home/jobs/Dhis2 Web Trunk/modules/org.hisp.dhis$dhis-web-reporting/builds/2011-04-07_10-47-55/archive/org.hisp.dhis/dhis-web-reporting/2.2-SNAPSHOT/dhis-web-reporting-2.2-SNAPSHOT.pom
[JENKINS] Archiving <http://dhis.uio.no/ci/job/Dhis2%20Web%20Trunk/ws/dhis-2/dhis-web/dhis-web-reporting/target/dhis-web-reporting.war> to /projects/hisp/jenkins_home/jobs/Dhis2 Web Trunk/modules/org.hisp.dhis$dhis-web-reporting/builds/2011-04-07_10-47-55/archive/org.hisp.dhis/dhis-web-reporting/2.2-SNAPSHOT/dhis-web-reporting-2.2-SNAPSHOT.war
[INFO] [resources:resources {execution: default-resources}]
[INFO] Using encoding: 'UTF-8' to copy filtered resources.
[INFO] [compiler:compile {execution: default-compile}]
[INFO] Nothing to compile - all classes are up to date
[INFO] [findbugs:findbugs {execution: default-cli}]
[INFO] Using source root:
[INFO] <http://dhis.uio.no/ci/job/Dhis2%20Web%20Trunk/ws/dhis-2/dhis-web/dhis-web-reporting/target/classes>
[INFO] Using test source root:
[INFO] <http://dhis.uio.no/ci/job/Dhis2%20Web%20Trunk/ws/dhis-2/dhis-web/dhis-web-reporting/target/test-classes>
[INFO] No effort provided, using default effort.
[INFO] Adding Source Directory: <http://dhis.uio.no/ci/job/Dhis2%20Web%20Trunk/ws/dhis-2/dhis-web/dhis-web-reporting/src/main/java>
[INFO] No threshold provided, using default threshold.
[INFO] Using FindBugs Version: 1.3.8
[INFO] No threshold provided, using default threshold.
[INFO] No threshold provided, using default threshold.
[INFO] No threshold provided, using default threshold.
[INFO] Using the xdoc format
[INFO] No effort provided, using default effort.
[INFO] No threshold provided, using default threshold.
[INFO] No threshold provided, using default threshold.
[INFO] Debugging is Off
[INFO] No bug include filter.
[INFO] Using bug exclude filter /tmp/plexus-resources2135013129tmp
[INFO] Printing Errors
[INFO] Printing Missing classes
[INFO] Printing Source Roots
[FINDBUGS] Successfully parsed file <http://dhis.uio.no/ci/job/Dhis2%20Web%20Trunk/ws/dhis-2/dhis-web/dhis-web-reporting/target/findbugsXml.xml> of module DHIS Web Reporting with 27 warnings.
[INFO] ------------------------------------------------------------------------
[INFO] Building DHIS Mapping
[INFO] task-segment: [clean, install, findbugs:findbugs]
[INFO] ------------------------------------------------------------------------
[INFO] [clean:clean {execution: default-clean}]
[INFO] Deleting directory <http://dhis.uio.no/ci/job/Dhis2%20Web%20Trunk/ws/dhis-2/dhis-web/dhis-web-mapping/target>
[INFO] [resources:resources {execution: default-resources}]
[INFO] Using encoding: 'UTF-8' to copy filtered resources.
[INFO] [compiler:compile {execution: default-compile}]
[INFO] Compiling 53 source files to <http://dhis.uio.no/ci/job/Dhis2%20Web%20Trunk/ws/dhis-2/dhis-web/dhis-web-mapping/target/classes>
[INFO] [resources:testResources {execution: default-testResources}]
[INFO] Using encoding: 'UTF-8' to copy filtered resources.
[INFO] [compiler:testCompile {execution: default-testCompile}]
[INFO] No sources to compile
[INFO] [surefire:test {execution: default-test}]
[INFO] No tests to run.
[JENKINS] Recording test results
[INFO] [war:war {execution: default-war}]
[INFO] Exploding webapp...
[INFO] Assembling webapp dhis-web-mapping in <http://dhis.uio.no/ci/job/Dhis2%20Web%20Trunk/ws/dhis-2/dhis-web/dhis-web-mapping/target/dhis-web-mapping>
[INFO] Copy webapp webResources to <http://dhis.uio.no/ci/job/Dhis2%20Web%20Trunk/ws/dhis-2/dhis-web/dhis-web-mapping/target/dhis-web-mapping>
[INFO] Building jar: <http://dhis.uio.no/ci/job/Dhis2%20Web%20Trunk/ws/dhis-2/dhis-web/dhis-web-mapping/target/dhis-web-mapping/WEB-INF/lib/dhis-web-mapping.jar>
[INFO] Expanding: <http://dhis.uio.no/ci/job/Dhis2%20Web%20Trunk/ws/dhis-2/dhis-web/dhis-web-commons-resources/target/dhis-web-commons-resources-2.2-SNAPSHOT.war> into <http://dhis.uio.no/ci/job/Dhis2%20Web%20Trunk/ws/dhis-2/dhis-web/dhis-web-mapping/target/war/work/dhis-web-commons-resources-2.2-SNAPSHOT>
[INFO] Overlaying 1 war(s).
[INFO] Generating war <http://dhis.uio.no/ci/job/Dhis2%20Web%20Trunk/ws/dhis-2/dhis-web/dhis-web-mapping/target/dhis-web-mapping.war>
[INFO] Building war: <http://dhis.uio.no/ci/job/Dhis2%20Web%20Trunk/ws/dhis-2/dhis-web/dhis-web-mapping/target/dhis-web-mapping.war>
[INFO] [install:install {execution: default-install}]
[INFO] Installing <http://dhis.uio.no/ci/job/Dhis2%20Web%20Trunk/ws/dhis-2/dhis-web/dhis-web-mapping/target/dhis-web-mapping.war> to /ifi/utgard/p01/dhis/.m2/repository/org/hisp/dhis/dhis-web-mapping/2.2-SNAPSHOT/dhis-web-mapping-2.2-SNAPSHOT.war
[INFO] Preparing findbugs:findbugs
[JENKINS] Archiving <http://dhis.uio.no/ci/job/Dhis2%20Web%20Trunk/ws/dhis-2/dhis-web/dhis-web-mapping/pom.xml> to /projects/hisp/jenkins_home/jobs/Dhis2 Web Trunk/modules/org.hisp.dhis$dhis-web-mapping/builds/2011-04-07_10-47-55/archive/org.hisp.dhis/dhis-web-mapping/2.2-SNAPSHOT/dhis-web-mapping-2.2-SNAPSHOT.pom
[JENKINS] Archiving <http://dhis.uio.no/ci/job/Dhis2%20Web%20Trunk/ws/dhis-2/dhis-web/dhis-web-mapping/target/dhis-web-mapping.war> to /projects/hisp/jenkins_home/jobs/Dhis2 Web Trunk/modules/org.hisp.dhis$dhis-web-mapping/builds/2011-04-07_10-47-55/archive/org.hisp.dhis/dhis-web-mapping/2.2-SNAPSHOT/dhis-web-mapping-2.2-SNAPSHOT.war
[INFO] [resources:resources {execution: default-resources}]
[INFO] Using encoding: 'UTF-8' to copy filtered resources.
[INFO] [compiler:compile {execution: default-compile}]
[INFO] Nothing to compile - all classes are up to date
[INFO] [findbugs:findbugs {execution: default-cli}]
[INFO] Using source root:
[INFO] <http://dhis.uio.no/ci/job/Dhis2%20Web%20Trunk/ws/dhis-2/dhis-web/dhis-web-mapping/target/classes>
[INFO] Using test source root:
[INFO] <http://dhis.uio.no/ci/job/Dhis2%20Web%20Trunk/ws/dhis-2/dhis-web/dhis-web-mapping/target/test-classes>
[INFO] No effort provided, using default effort.
[INFO] Adding Source Directory: <http://dhis.uio.no/ci/job/Dhis2%20Web%20Trunk/ws/dhis-2/dhis-web/dhis-web-mapping/src/main/java>
[INFO] No threshold provided, using default threshold.
[INFO] Using FindBugs Version: 1.3.8
[INFO] No threshold provided, using default threshold.
[INFO] No threshold provided, using default threshold.
[INFO] No threshold provided, using default threshold.
[INFO] Using the xdoc format
[INFO] No effort provided, using default effort.
[INFO] No threshold provided, using default threshold.
[INFO] No threshold provided, using default threshold.
[INFO] Debugging is Off
[INFO] No bug include filter.
[INFO] Using bug exclude filter /tmp/plexus-resources1898051399tmp
[FINDBUGS] Successfully parsed file <http://dhis.uio.no/ci/job/Dhis2%20Web%20Trunk/ws/dhis-2/dhis-web/dhis-web-mapping/target/findbugsXml.xml> of module DHIS Mapping with 12 warnings.
[INFO] Printing Errors
[INFO] Printing Missing classes
[INFO] Printing Source Roots
[INFO] ------------------------------------------------------------------------
[INFO] Building DHIS Web Dashboard Integration module
[INFO] task-segment: [clean, install, findbugs:findbugs]
[INFO] ------------------------------------------------------------------------
[INFO] [clean:clean {execution: default-clean}]
[INFO] Deleting directory <http://dhis.uio.no/ci/job/Dhis2%20Web%20Trunk/ws/dhis-2/dhis-web/dhis-web-dashboard-integration/target>
[INFO] [resources:resources {execution: default-resources}]
[INFO] Using encoding: 'UTF-8' to copy filtered resources.
[INFO] [compiler:compile {execution: default-compile}]
[INFO] Compiling 15 source files to <http://dhis.uio.no/ci/job/Dhis2%20Web%20Trunk/ws/dhis-2/dhis-web/dhis-web-dashboard-integration/target/classes>
[INFO] [resources:testResources {execution: default-testResources}]
[INFO] Using encoding: 'UTF-8' to copy filtered resources.
[INFO] [compiler:testCompile {execution: default-testCompile}]
[INFO] No sources to compile
[INFO] [surefire:test {execution: default-test}]
[INFO] No tests to run.
[JENKINS] Recording test results
[INFO] [war:war {execution: default-war}]
[INFO] Exploding webapp...
[INFO] Assembling webapp dhis-web-dashboard-integration in <http://dhis.uio.no/ci/job/Dhis2%20Web%20Trunk/ws/dhis-2/dhis-web/dhis-web-dashboard-integration/target/dhis-web-dashboard-integration>
[INFO] Copy webapp webResources to <http://dhis.uio.no/ci/job/Dhis2%20Web%20Trunk/ws/dhis-2/dhis-web/dhis-web-dashboard-integration/target/dhis-web-dashboard-integration>
[INFO] Building jar: <http://dhis.uio.no/ci/job/Dhis2%20Web%20Trunk/ws/dhis-2/dhis-web/dhis-web-dashboard-integration/target/dhis-web-dashboard-integration/WEB-INF/lib/dhis-web-dashboard-integration.jar>
[INFO] Expanding: <http://dhis.uio.no/ci/job/Dhis2%20Web%20Trunk/ws/dhis-2/dhis-web/dhis-web-commons-resources/target/dhis-web-commons-resources-2.2-SNAPSHOT.war> into <http://dhis.uio.no/ci/job/Dhis2%20Web%20Trunk/ws/dhis-2/dhis-web/dhis-web-dashboard-integration/target/war/work/dhis-web-commons-resources-2.2-SNAPSHOT>
[INFO] Overlaying 1 war(s).
[INFO] Generating war <http://dhis.uio.no/ci/job/Dhis2%20Web%20Trunk/ws/dhis-2/dhis-web/dhis-web-dashboard-integration/target/dhis-web-dashboard-integration.war>
[INFO] Building war: <http://dhis.uio.no/ci/job/Dhis2%20Web%20Trunk/ws/dhis-2/dhis-web/dhis-web-dashboard-integration/target/dhis-web-dashboard-integration.war>
[INFO] [install:install {execution: default-install}]
[INFO] Installing <http://dhis.uio.no/ci/job/Dhis2%20Web%20Trunk/ws/dhis-2/dhis-web/dhis-web-dashboard-integration/target/dhis-web-dashboard-integration.war> to /ifi/utgard/p01/dhis/.m2/repository/org/hisp/dhis/dhis-web-dashboard-integration/2.2-SNAPSHOT/dhis-web-dashboard-integration-2.2-SNAPSHOT.war
[INFO] Preparing findbugs:findbugs
[JENKINS] Archiving <http://dhis.uio.no/ci/job/Dhis2%20Web%20Trunk/ws/dhis-2/dhis-web/dhis-web-dashboard-integration/pom.xml> to /projects/hisp/jenkins_home/jobs/Dhis2 Web Trunk/modules/org.hisp.dhis$dhis-web-dashboard-integration/builds/2011-04-07_10-47-55/archive/org.hisp.dhis/dhis-web-dashboard-integration/2.2-SNAPSHOT/dhis-web-dashboard-integration-2.2-SNAPSHOT.pom
[JENKINS] Archiving <http://dhis.uio.no/ci/job/Dhis2%20Web%20Trunk/ws/dhis-2/dhis-web/dhis-web-dashboard-integration/target/dhis-web-dashboard-integration.war> to /projects/hisp/jenkins_home/jobs/Dhis2 Web Trunk/modules/org.hisp.dhis$dhis-web-dashboard-integration/builds/2011-04-07_10-47-55/archive/org.hisp.dhis/dhis-web-dashboard-integration/2.2-SNAPSHOT/dhis-web-dashboard-integration-2.2-SNAPSHOT.war
[INFO] [resources:resources {execution: default-resources}]
[INFO] Using encoding: 'UTF-8' to copy filtered resources.
[INFO] [compiler:compile {execution: default-compile}]
[INFO] Nothing to compile - all classes are up to date
[INFO] [findbugs:findbugs {execution: default-cli}]
[INFO] Using source root:
[INFO] <http://dhis.uio.no/ci/job/Dhis2%20Web%20Trunk/ws/dhis-2/dhis-web/dhis-web-dashboard-integration/target/classes>
[INFO] Using test source root:
[INFO] <http://dhis.uio.no/ci/job/Dhis2%20Web%20Trunk/ws/dhis-2/dhis-web/dhis-web-dashboard-integration/target/test-classes>
[INFO] No effort provided, using default effort.
[INFO] Adding Source Directory: <http://dhis.uio.no/ci/job/Dhis2%20Web%20Trunk/ws/dhis-2/dhis-web/dhis-web-dashboard-integration/src/main/java>
[INFO] No threshold provided, using default threshold.
[INFO] Using FindBugs Version: 1.3.8
[INFO] No threshold provided, using default threshold.
[INFO] No threshold provided, using default threshold.
[INFO] No threshold provided, using default threshold.
[INFO] Using the xdoc format
[INFO] No effort provided, using default effort.
[INFO] No threshold provided, using default threshold.
[INFO] No threshold provided, using default threshold.
[INFO] Debugging is Off
[INFO] No bug include filter.
[INFO] Using bug exclude filter /tmp/plexus-resources762422075tmp
[INFO] Printing Errors
[INFO] Printing Missing classes
[INFO] Printing Source Roots
[FINDBUGS] Successfully parsed file <http://dhis.uio.no/ci/job/Dhis2%20Web%20Trunk/ws/dhis-2/dhis-web/dhis-web-dashboard-integration/target/findbugsXml.xml> of module DHIS Web Dashboard Integration module with 0 warnings.
[INFO] ------------------------------------------------------------------------
[INFO] Building DHIS Case Entry
[INFO] task-segment: [clean, install, findbugs:findbugs]
[INFO] ------------------------------------------------------------------------
[INFO] [clean:clean {execution: default-clean}]
[INFO] Deleting directory <http://dhis.uio.no/ci/job/Dhis2%20Web%20Trunk/ws/dhis-2/dhis-web/dhis-web-caseentry/target>
[INFO] [resources:resources {execution: default-resources}]
[INFO] Using encoding: 'UTF-8' to copy filtered resources.
[INFO] [compiler:compile {execution: default-compile}]
[INFO] Compiling 38 source files to <http://dhis.uio.no/ci/job/Dhis2%20Web%20Trunk/ws/dhis-2/dhis-web/dhis-web-caseentry/target/classes>
[JENKINS] Archiving <http://dhis.uio.no/ci/job/Dhis2%20Web%20Trunk/ws/dhis-2/dhis-web/dhis-web-caseentry/pom.xml> to /projects/hisp/jenkins_home/jobs/Dhis2 Web Trunk/modules/org.hisp.dhis$dhis-web-caseentry/builds/2011-04-07_10-47-55/archive/org.hisp.dhis/dhis-web-caseentry/2.2-SNAPSHOT/dhis-web-caseentry-2.2-SNAPSHOT.pom
[INFO] ------------------------------------------------------------------------
[ERROR] BUILD FAILURE
[INFO] ------------------------------------------------------------------------
[INFO] Compilation failure

<http://dhis.uio.no/ci/job/Dhis2%20Web%20Trunk/ws/dhis-2/dhis-web/dhis-web-caseentry/src/main/java/org/hisp/dhis/caseentry/action/caseentry/SearchPatientAction.java>:[199,37] cannot find symbol
symbol : method getPatients(java.lang.String)
location: interface org.hisp.dhis.patient.PatientService

<http://dhis.uio.no/ci/job/Dhis2%20Web%20Trunk/ws/dhis-2/dhis-web/dhis-web-caseentry/src/main/java/org/hisp/dhis/caseentry/action/caseentry/SearchPatientAction.java>:[235,33] cannot find symbol
symbol : method getPatients(java.lang.String)
location: interface org.hisp.dhis.patient.PatientService

[INFO] ------------------------------------------------------------------------
[INFO] For more information, run Maven with the -e switch
[INFO] ------------------------------------------------------------------------
[INFO] Total time: 12 minutes 6 seconds
[INFO] Finished at: Thu Apr 07 11:00:09 CEST 2011
[INFO] Final Memory: 195M/465M
[INFO] ------------------------------------------------------------------------
Sending e-mails to: dhis2-devs@lists.launchpad.net
channel stopped
Archiving artifacts
ERROR: Ignore Problem expanding maven opts macros org.jenkinsci.plugins.tokenmacro.TokenMacro
Performing Post build task...
Could not match :DHIS Web Portal ....................................... SUCCESS : False
Logical operation result is FALSE
Skipping script : echo "Building webapp succeeded. Deploying to dev"
/ifi/utgard/p01/dhis/bin/redeploy-dhis-snapshot
END OF POST BUILD TASK : 0

See <http://dhis.uio.no/ci/job/Dhis2%20Web%20Trunk/2360/changes>

Changes:

[Lars Helge Overland] Work in progress

···

------------------------------------------
[...truncated 837 lines...]
[INFO] Building war: <http://dhis.uio.no/ci/job/Dhis2%20Web%20Trunk/ws/dhis-2/dhis-web/dhis-web-validationrule/target/dhis-web-validationrule.war>
[INFO] [install:install {execution: default-install}]
[INFO] Installing <http://dhis.uio.no/ci/job/Dhis2%20Web%20Trunk/ws/dhis-2/dhis-web/dhis-web-validationrule/target/dhis-web-validationrule.war> to /ifi/utgard/p01/dhis/.m2/repository/org/hisp/dhis/dhis-web-validationrule/2.2-SNAPSHOT/dhis-web-validationrule-2.2-SNAPSHOT.war
[INFO] Preparing findbugs:findbugs
[JENKINS] Archiving <http://dhis.uio.no/ci/job/Dhis2%20Web%20Trunk/ws/dhis-2/dhis-web/dhis-web-validationrule/pom.xml> to /projects/hisp/jenkins_home/jobs/Dhis2 Web Trunk/modules/org.hisp.dhis$dhis-web-validationrule/builds/2011-04-07_11-17-39/archive/org.hisp.dhis/dhis-web-validationrule/2.2-SNAPSHOT/dhis-web-validationrule-2.2-SNAPSHOT.pom
[JENKINS] Archiving <http://dhis.uio.no/ci/job/Dhis2%20Web%20Trunk/ws/dhis-2/dhis-web/dhis-web-validationrule/target/dhis-web-validationrule.war> to /projects/hisp/jenkins_home/jobs/Dhis2 Web Trunk/modules/org.hisp.dhis$dhis-web-validationrule/builds/2011-04-07_11-17-39/archive/org.hisp.dhis/dhis-web-validationrule/2.2-SNAPSHOT/dhis-web-validationrule-2.2-SNAPSHOT.war
[INFO] [resources:resources {execution: default-resources}]
[INFO] Using encoding: 'UTF-8' to copy filtered resources.
[INFO] [compiler:compile {execution: default-compile}]
[INFO] Nothing to compile - all classes are up to date
[INFO] [findbugs:findbugs {execution: default-cli}]
[INFO] Using source root:
[INFO] <http://dhis.uio.no/ci/job/Dhis2%20Web%20Trunk/ws/dhis-2/dhis-web/dhis-web-validationrule/target/classes>
[INFO] Using test source root:
[INFO] <http://dhis.uio.no/ci/job/Dhis2%20Web%20Trunk/ws/dhis-2/dhis-web/dhis-web-validationrule/target/test-classes>
[INFO] No effort provided, using default effort.
[INFO] Adding Source Directory: <http://dhis.uio.no/ci/job/Dhis2%20Web%20Trunk/ws/dhis-2/dhis-web/dhis-web-validationrule/src/main/java>
[INFO] No threshold provided, using default threshold.
[INFO] Using FindBugs Version: 1.3.8
[INFO] No threshold provided, using default threshold.
[INFO] No threshold provided, using default threshold.
[INFO] No threshold provided, using default threshold.
[INFO] Using the xdoc format
[INFO] No effort provided, using default effort.
[INFO] No threshold provided, using default threshold.
[INFO] No threshold provided, using default threshold.
[INFO] Debugging is Off
[INFO] No bug include filter.
[INFO] Using bug exclude filter /tmp/plexus-resources1322924298tmp
[INFO] Printing Errors
[INFO] Printing Missing classes
[INFO] Printing Source Roots
[FINDBUGS] Successfully parsed file <http://dhis.uio.no/ci/job/Dhis2%20Web%20Trunk/ws/dhis-2/dhis-web/dhis-web-validationrule/target/findbugsXml.xml> of module DHIS Validation Rule with 42 warnings.
[INFO] ------------------------------------------------------------------------
[INFO] Building DHIS Web Reporting
[INFO] task-segment: [clean, install, findbugs:findbugs]
[INFO] ------------------------------------------------------------------------
[INFO] [clean:clean {execution: default-clean}]
[INFO] Deleting directory <http://dhis.uio.no/ci/job/Dhis2%20Web%20Trunk/ws/dhis-2/dhis-web/dhis-web-reporting/target>
[INFO] [resources:resources {execution: default-resources}]
[INFO] Using encoding: 'UTF-8' to copy filtered resources.
[INFO] [compiler:compile {execution: default-compile}]
[INFO] Compiling 54 source files to <http://dhis.uio.no/ci/job/Dhis2%20Web%20Trunk/ws/dhis-2/dhis-web/dhis-web-reporting/target/classes>
[INFO] [resources:testResources {execution: default-testResources}]
[INFO] Using encoding: 'UTF-8' to copy filtered resources.
[INFO] [compiler:testCompile {execution: default-testCompile}]
[INFO] No sources to compile
[INFO] [surefire:test {execution: default-test}]
[INFO] No tests to run.
[JENKINS] Recording test results
[INFO] [war:war {execution: default-war}]
[INFO] Exploding webapp...
[INFO] Assembling webapp dhis-web-reporting in <http://dhis.uio.no/ci/job/Dhis2%20Web%20Trunk/ws/dhis-2/dhis-web/dhis-web-reporting/target/dhis-web-reporting>
[INFO] Copy webapp webResources to <http://dhis.uio.no/ci/job/Dhis2%20Web%20Trunk/ws/dhis-2/dhis-web/dhis-web-reporting/target/dhis-web-reporting>
[INFO] Building jar: <http://dhis.uio.no/ci/job/Dhis2%20Web%20Trunk/ws/dhis-2/dhis-web/dhis-web-reporting/target/dhis-web-reporting/WEB-INF/lib/dhis-web-reporting.jar>
[INFO] Expanding: <http://dhis.uio.no/ci/job/Dhis2%20Web%20Trunk/ws/dhis-2/dhis-web/dhis-web-commons-resources/target/dhis-web-commons-resources-2.2-SNAPSHOT.war> into <http://dhis.uio.no/ci/job/Dhis2%20Web%20Trunk/ws/dhis-2/dhis-web/dhis-web-reporting/target/war/work/dhis-web-commons-resources-2.2-SNAPSHOT>
[INFO] Overlaying 1 war(s).
[INFO] Generating war <http://dhis.uio.no/ci/job/Dhis2%20Web%20Trunk/ws/dhis-2/dhis-web/dhis-web-reporting/target/dhis-web-reporting.war>
[INFO] Building war: <http://dhis.uio.no/ci/job/Dhis2%20Web%20Trunk/ws/dhis-2/dhis-web/dhis-web-reporting/target/dhis-web-reporting.war>
[INFO] [install:install {execution: default-install}]
[INFO] Installing <http://dhis.uio.no/ci/job/Dhis2%20Web%20Trunk/ws/dhis-2/dhis-web/dhis-web-reporting/target/dhis-web-reporting.war> to /ifi/utgard/p01/dhis/.m2/repository/org/hisp/dhis/dhis-web-reporting/2.2-SNAPSHOT/dhis-web-reporting-2.2-SNAPSHOT.war
[INFO] Preparing findbugs:findbugs
[JENKINS] Archiving <http://dhis.uio.no/ci/job/Dhis2%20Web%20Trunk/ws/dhis-2/dhis-web/dhis-web-reporting/pom.xml> to /projects/hisp/jenkins_home/jobs/Dhis2 Web Trunk/modules/org.hisp.dhis$dhis-web-reporting/builds/2011-04-07_11-17-39/archive/org.hisp.dhis/dhis-web-reporting/2.2-SNAPSHOT/dhis-web-reporting-2.2-SNAPSHOT.pom
[JENKINS] Archiving <http://dhis.uio.no/ci/job/Dhis2%20Web%20Trunk/ws/dhis-2/dhis-web/dhis-web-reporting/target/dhis-web-reporting.war> to /projects/hisp/jenkins_home/jobs/Dhis2 Web Trunk/modules/org.hisp.dhis$dhis-web-reporting/builds/2011-04-07_11-17-39/archive/org.hisp.dhis/dhis-web-reporting/2.2-SNAPSHOT/dhis-web-reporting-2.2-SNAPSHOT.war
[INFO] [resources:resources {execution: default-resources}]
[INFO] Using encoding: 'UTF-8' to copy filtered resources.
[INFO] [compiler:compile {execution: default-compile}]
[INFO] Nothing to compile - all classes are up to date
[INFO] [findbugs:findbugs {execution: default-cli}]
[INFO] Using source root:
[INFO] <http://dhis.uio.no/ci/job/Dhis2%20Web%20Trunk/ws/dhis-2/dhis-web/dhis-web-reporting/target/classes>
[INFO] Using test source root:
[INFO] <http://dhis.uio.no/ci/job/Dhis2%20Web%20Trunk/ws/dhis-2/dhis-web/dhis-web-reporting/target/test-classes>
[INFO] No effort provided, using default effort.
[INFO] Adding Source Directory: <http://dhis.uio.no/ci/job/Dhis2%20Web%20Trunk/ws/dhis-2/dhis-web/dhis-web-reporting/src/main/java>
[INFO] No threshold provided, using default threshold.
[INFO] Using FindBugs Version: 1.3.8
[INFO] No threshold provided, using default threshold.
[INFO] No threshold provided, using default threshold.
[INFO] No threshold provided, using default threshold.
[INFO] Using the xdoc format
[INFO] No effort provided, using default effort.
[INFO] No threshold provided, using default threshold.
[INFO] No threshold provided, using default threshold.
[INFO] Debugging is Off
[INFO] No bug include filter.
[INFO] Using bug exclude filter /tmp/plexus-resources2033660536tmp
[INFO] Printing Errors
[INFO] Printing Missing classes
[INFO] Printing Source Roots
[FINDBUGS] Successfully parsed file <http://dhis.uio.no/ci/job/Dhis2%20Web%20Trunk/ws/dhis-2/dhis-web/dhis-web-reporting/target/findbugsXml.xml> of module DHIS Web Reporting with 27 warnings.
[INFO] ------------------------------------------------------------------------
[INFO] Building DHIS Mapping
[INFO] task-segment: [clean, install, findbugs:findbugs]
[INFO] ------------------------------------------------------------------------
[INFO] [clean:clean {execution: default-clean}]
[INFO] Deleting directory <http://dhis.uio.no/ci/job/Dhis2%20Web%20Trunk/ws/dhis-2/dhis-web/dhis-web-mapping/target>
[INFO] [resources:resources {execution: default-resources}]
[INFO] Using encoding: 'UTF-8' to copy filtered resources.
[INFO] [compiler:compile {execution: default-compile}]
[INFO] Compiling 53 source files to <http://dhis.uio.no/ci/job/Dhis2%20Web%20Trunk/ws/dhis-2/dhis-web/dhis-web-mapping/target/classes>
[INFO] [resources:testResources {execution: default-testResources}]
[INFO] Using encoding: 'UTF-8' to copy filtered resources.
[INFO] [compiler:testCompile {execution: default-testCompile}]
[INFO] No sources to compile
[INFO] [surefire:test {execution: default-test}]
[INFO] No tests to run.
[JENKINS] Recording test results
[INFO] [war:war {execution: default-war}]
[INFO] Exploding webapp...
[INFO] Assembling webapp dhis-web-mapping in <http://dhis.uio.no/ci/job/Dhis2%20Web%20Trunk/ws/dhis-2/dhis-web/dhis-web-mapping/target/dhis-web-mapping>
[INFO] Copy webapp webResources to <http://dhis.uio.no/ci/job/Dhis2%20Web%20Trunk/ws/dhis-2/dhis-web/dhis-web-mapping/target/dhis-web-mapping>
[INFO] Building jar: <http://dhis.uio.no/ci/job/Dhis2%20Web%20Trunk/ws/dhis-2/dhis-web/dhis-web-mapping/target/dhis-web-mapping/WEB-INF/lib/dhis-web-mapping.jar>
[INFO] Expanding: <http://dhis.uio.no/ci/job/Dhis2%20Web%20Trunk/ws/dhis-2/dhis-web/dhis-web-commons-resources/target/dhis-web-commons-resources-2.2-SNAPSHOT.war> into <http://dhis.uio.no/ci/job/Dhis2%20Web%20Trunk/ws/dhis-2/dhis-web/dhis-web-mapping/target/war/work/dhis-web-commons-resources-2.2-SNAPSHOT>
[INFO] Overlaying 1 war(s).
[INFO] Generating war <http://dhis.uio.no/ci/job/Dhis2%20Web%20Trunk/ws/dhis-2/dhis-web/dhis-web-mapping/target/dhis-web-mapping.war>
[INFO] Building war: <http://dhis.uio.no/ci/job/Dhis2%20Web%20Trunk/ws/dhis-2/dhis-web/dhis-web-mapping/target/dhis-web-mapping.war>
[INFO] [install:install {execution: default-install}]
[INFO] Installing <http://dhis.uio.no/ci/job/Dhis2%20Web%20Trunk/ws/dhis-2/dhis-web/dhis-web-mapping/target/dhis-web-mapping.war> to /ifi/utgard/p01/dhis/.m2/repository/org/hisp/dhis/dhis-web-mapping/2.2-SNAPSHOT/dhis-web-mapping-2.2-SNAPSHOT.war
[INFO] Preparing findbugs:findbugs
[JENKINS] Archiving <http://dhis.uio.no/ci/job/Dhis2%20Web%20Trunk/ws/dhis-2/dhis-web/dhis-web-mapping/pom.xml> to /projects/hisp/jenkins_home/jobs/Dhis2 Web Trunk/modules/org.hisp.dhis$dhis-web-mapping/builds/2011-04-07_11-17-39/archive/org.hisp.dhis/dhis-web-mapping/2.2-SNAPSHOT/dhis-web-mapping-2.2-SNAPSHOT.pom
[JENKINS] Archiving <http://dhis.uio.no/ci/job/Dhis2%20Web%20Trunk/ws/dhis-2/dhis-web/dhis-web-mapping/target/dhis-web-mapping.war> to /projects/hisp/jenkins_home/jobs/Dhis2 Web Trunk/modules/org.hisp.dhis$dhis-web-mapping/builds/2011-04-07_11-17-39/archive/org.hisp.dhis/dhis-web-mapping/2.2-SNAPSHOT/dhis-web-mapping-2.2-SNAPSHOT.war
[INFO] [resources:resources {execution: default-resources}]
[INFO] Using encoding: 'UTF-8' to copy filtered resources.
[INFO] [compiler:compile {execution: default-compile}]
[INFO] Nothing to compile - all classes are up to date
[INFO] [findbugs:findbugs {execution: default-cli}]
[INFO] Using source root:
[INFO] <http://dhis.uio.no/ci/job/Dhis2%20Web%20Trunk/ws/dhis-2/dhis-web/dhis-web-mapping/target/classes>
[INFO] Using test source root:
[INFO] <http://dhis.uio.no/ci/job/Dhis2%20Web%20Trunk/ws/dhis-2/dhis-web/dhis-web-mapping/target/test-classes>
[INFO] No effort provided, using default effort.
[INFO] Adding Source Directory: <http://dhis.uio.no/ci/job/Dhis2%20Web%20Trunk/ws/dhis-2/dhis-web/dhis-web-mapping/src/main/java>
[INFO] No threshold provided, using default threshold.
[INFO] Using FindBugs Version: 1.3.8
[INFO] No threshold provided, using default threshold.
[INFO] No threshold provided, using default threshold.
[INFO] No threshold provided, using default threshold.
[INFO] Using the xdoc format
[INFO] No effort provided, using default effort.
[INFO] No threshold provided, using default threshold.
[INFO] No threshold provided, using default threshold.
[INFO] Debugging is Off
[INFO] No bug include filter.
[INFO] Using bug exclude filter /tmp/plexus-resources2143201925tmp
[INFO] Printing Errors
[INFO] Printing Missing classes
[INFO] Printing Source Roots
[FINDBUGS] Successfully parsed file <http://dhis.uio.no/ci/job/Dhis2%20Web%20Trunk/ws/dhis-2/dhis-web/dhis-web-mapping/target/findbugsXml.xml> of module DHIS Mapping with 12 warnings.
[INFO] ------------------------------------------------------------------------
[INFO] Building DHIS Web Dashboard Integration module
[INFO] task-segment: [clean, install, findbugs:findbugs]
[INFO] ------------------------------------------------------------------------
[INFO] [clean:clean {execution: default-clean}]
[INFO] Deleting directory <http://dhis.uio.no/ci/job/Dhis2%20Web%20Trunk/ws/dhis-2/dhis-web/dhis-web-dashboard-integration/target>
[INFO] [resources:resources {execution: default-resources}]
[INFO] Using encoding: 'UTF-8' to copy filtered resources.
[INFO] [compiler:compile {execution: default-compile}]
[INFO] Compiling 15 source files to <http://dhis.uio.no/ci/job/Dhis2%20Web%20Trunk/ws/dhis-2/dhis-web/dhis-web-dashboard-integration/target/classes>
[INFO] [resources:testResources {execution: default-testResources}]
[INFO] Using encoding: 'UTF-8' to copy filtered resources.
[INFO] [compiler:testCompile {execution: default-testCompile}]
[INFO] No sources to compile
[INFO] [surefire:test {execution: default-test}]
[INFO] No tests to run.
[JENKINS] Recording test results
[INFO] [war:war {execution: default-war}]
[INFO] Exploding webapp...
[INFO] Assembling webapp dhis-web-dashboard-integration in <http://dhis.uio.no/ci/job/Dhis2%20Web%20Trunk/ws/dhis-2/dhis-web/dhis-web-dashboard-integration/target/dhis-web-dashboard-integration>
[INFO] Copy webapp webResources to <http://dhis.uio.no/ci/job/Dhis2%20Web%20Trunk/ws/dhis-2/dhis-web/dhis-web-dashboard-integration/target/dhis-web-dashboard-integration>
[INFO] Building jar: <http://dhis.uio.no/ci/job/Dhis2%20Web%20Trunk/ws/dhis-2/dhis-web/dhis-web-dashboard-integration/target/dhis-web-dashboard-integration/WEB-INF/lib/dhis-web-dashboard-integration.jar>
[INFO] Expanding: <http://dhis.uio.no/ci/job/Dhis2%20Web%20Trunk/ws/dhis-2/dhis-web/dhis-web-commons-resources/target/dhis-web-commons-resources-2.2-SNAPSHOT.war> into <http://dhis.uio.no/ci/job/Dhis2%20Web%20Trunk/ws/dhis-2/dhis-web/dhis-web-dashboard-integration/target/war/work/dhis-web-commons-resources-2.2-SNAPSHOT>
[INFO] Overlaying 1 war(s).
[INFO] Generating war <http://dhis.uio.no/ci/job/Dhis2%20Web%20Trunk/ws/dhis-2/dhis-web/dhis-web-dashboard-integration/target/dhis-web-dashboard-integration.war>
[INFO] Building war: <http://dhis.uio.no/ci/job/Dhis2%20Web%20Trunk/ws/dhis-2/dhis-web/dhis-web-dashboard-integration/target/dhis-web-dashboard-integration.war>
[INFO] [install:install {execution: default-install}]
[INFO] Installing <http://dhis.uio.no/ci/job/Dhis2%20Web%20Trunk/ws/dhis-2/dhis-web/dhis-web-dashboard-integration/target/dhis-web-dashboard-integration.war> to /ifi/utgard/p01/dhis/.m2/repository/org/hisp/dhis/dhis-web-dashboard-integration/2.2-SNAPSHOT/dhis-web-dashboard-integration-2.2-SNAPSHOT.war
[INFO] Preparing findbugs:findbugs
[JENKINS] Archiving <http://dhis.uio.no/ci/job/Dhis2%20Web%20Trunk/ws/dhis-2/dhis-web/dhis-web-dashboard-integration/pom.xml> to /projects/hisp/jenkins_home/jobs/Dhis2 Web Trunk/modules/org.hisp.dhis$dhis-web-dashboard-integration/builds/2011-04-07_11-17-39/archive/org.hisp.dhis/dhis-web-dashboard-integration/2.2-SNAPSHOT/dhis-web-dashboard-integration-2.2-SNAPSHOT.pom
[JENKINS] Archiving <http://dhis.uio.no/ci/job/Dhis2%20Web%20Trunk/ws/dhis-2/dhis-web/dhis-web-dashboard-integration/target/dhis-web-dashboard-integration.war> to /projects/hisp/jenkins_home/jobs/Dhis2 Web Trunk/modules/org.hisp.dhis$dhis-web-dashboard-integration/builds/2011-04-07_11-17-39/archive/org.hisp.dhis/dhis-web-dashboard-integration/2.2-SNAPSHOT/dhis-web-dashboard-integration-2.2-SNAPSHOT.war
[INFO] [resources:resources {execution: default-resources}]
[INFO] Using encoding: 'UTF-8' to copy filtered resources.
[INFO] [compiler:compile {execution: default-compile}]
[INFO] Nothing to compile - all classes are up to date
[INFO] [findbugs:findbugs {execution: default-cli}]
[INFO] Using source root:
[INFO] <http://dhis.uio.no/ci/job/Dhis2%20Web%20Trunk/ws/dhis-2/dhis-web/dhis-web-dashboard-integration/target/classes>
[INFO] Using test source root:
[INFO] <http://dhis.uio.no/ci/job/Dhis2%20Web%20Trunk/ws/dhis-2/dhis-web/dhis-web-dashboard-integration/target/test-classes>
[INFO] No effort provided, using default effort.
[INFO] Adding Source Directory: <http://dhis.uio.no/ci/job/Dhis2%20Web%20Trunk/ws/dhis-2/dhis-web/dhis-web-dashboard-integration/src/main/java>
[INFO] No threshold provided, using default threshold.
[INFO] Using FindBugs Version: 1.3.8
[INFO] No threshold provided, using default threshold.
[INFO] No threshold provided, using default threshold.
[INFO] No threshold provided, using default threshold.
[INFO] Using the xdoc format
[INFO] No effort provided, using default effort.
[INFO] No threshold provided, using default threshold.
[INFO] No threshold provided, using default threshold.
[INFO] Debugging is Off
[INFO] No bug include filter.
[INFO] Using bug exclude filter /tmp/plexus-resources1658806578tmp
[INFO] Printing Errors
[INFO] Printing Missing classes
[INFO] Printing Source Roots
[FINDBUGS] Successfully parsed file <http://dhis.uio.no/ci/job/Dhis2%20Web%20Trunk/ws/dhis-2/dhis-web/dhis-web-dashboard-integration/target/findbugsXml.xml> of module DHIS Web Dashboard Integration module with 0 warnings.
[INFO] ------------------------------------------------------------------------
[INFO] Building DHIS Case Entry
[INFO] task-segment: [clean, install, findbugs:findbugs]
[INFO] ------------------------------------------------------------------------
[INFO] [clean:clean {execution: default-clean}]
[INFO] Deleting directory <http://dhis.uio.no/ci/job/Dhis2%20Web%20Trunk/ws/dhis-2/dhis-web/dhis-web-caseentry/target>
[INFO] [resources:resources {execution: default-resources}]
[INFO] Using encoding: 'UTF-8' to copy filtered resources.
[INFO] [compiler:compile {execution: default-compile}]
[INFO] Compiling 38 source files to <http://dhis.uio.no/ci/job/Dhis2%20Web%20Trunk/ws/dhis-2/dhis-web/dhis-web-caseentry/target/classes>
[JENKINS] Archiving <http://dhis.uio.no/ci/job/Dhis2%20Web%20Trunk/ws/dhis-2/dhis-web/dhis-web-caseentry/pom.xml> to /projects/hisp/jenkins_home/jobs/Dhis2 Web Trunk/modules/org.hisp.dhis$dhis-web-caseentry/builds/2011-04-07_11-17-39/archive/org.hisp.dhis/dhis-web-caseentry/2.2-SNAPSHOT/dhis-web-caseentry-2.2-SNAPSHOT.pom
[INFO] ------------------------------------------------------------------------
[ERROR] BUILD FAILURE
[INFO] ------------------------------------------------------------------------
[INFO] Compilation failure

<http://dhis.uio.no/ci/job/Dhis2%20Web%20Trunk/ws/dhis-2/dhis-web/dhis-web-caseentry/src/main/java/org/hisp/dhis/caseentry/action/caseentry/SearchPatientAction.java>:[199,37] cannot find symbol
symbol : method getPatients(java.lang.String)
location: interface org.hisp.dhis.patient.PatientService

<http://dhis.uio.no/ci/job/Dhis2%20Web%20Trunk/ws/dhis-2/dhis-web/dhis-web-caseentry/src/main/java/org/hisp/dhis/caseentry/action/caseentry/SearchPatientAction.java>:[235,33] cannot find symbol
symbol : method getPatients(java.lang.String)
location: interface org.hisp.dhis.patient.PatientService

[INFO] ------------------------------------------------------------------------
[INFO] For more information, run Maven with the -e switch
[INFO] ------------------------------------------------------------------------
[INFO] Total time: 12 minutes 26 seconds
[INFO] Finished at: Thu Apr 07 11:30:12 CEST 2011
[INFO] Final Memory: 196M/469M
[INFO] ------------------------------------------------------------------------
Sending e-mails to: dhis2-devs@lists.launchpad.net
channel stopped
Archiving artifacts
ERROR: Ignore Problem expanding maven opts macros org.jenkinsci.plugins.tokenmacro.TokenMacro
Performing Post build task...
Could not match :DHIS Web Portal ....................................... SUCCESS : False
Logical operation result is FALSE
Skipping script : echo "Building webapp succeeded. Deploying to dev"
/ifi/utgard/p01/dhis/bin/redeploy-dhis-snapshot
END OF POST BUILD TASK : 0

See <http://dhis.uio.no/ci/job/Dhis2%20Web%20Trunk/2361/changes>