Build failed in Jenkins: Dhis2 Web Trunk #2067

See <http://dhis.uio.no/ci/job/Dhis2%20Web%20Trunk/2067/changes>

Changes:

[Jan Henrik Overland] (GIS) View history implemented.

···

------------------------------------------
[...truncated 355 lines...]
[INFO] No sources to compile
[HUDSON] Recording test results
[INFO] [surefire:test {execution: default-test}]
[INFO] No tests to run.
[INFO] [war:war {execution: default-war}]
[INFO] Exploding webapp...
[INFO] Assembling webapp dhis-web-maintenance-organisationunit in <http://dhis.uio.no/ci/job/Dhis2%20Web%20Trunk/ws/dhis-2/dhis-web/dhis-web-maintenance/dhis-web-maintenance-organisationunit/target/dhis-web-maintenance-organisationunit>
[INFO] Copy webapp webResources to <http://dhis.uio.no/ci/job/Dhis2%20Web%20Trunk/ws/dhis-2/dhis-web/dhis-web-maintenance/dhis-web-maintenance-organisationunit/target/dhis-web-maintenance-organisationunit>
[INFO] Building jar: <http://dhis.uio.no/ci/job/Dhis2%20Web%20Trunk/ws/dhis-2/dhis-web/dhis-web-maintenance/dhis-web-maintenance-organisationunit/target/dhis-web-maintenance-organisationunit/WEB-INF/lib/dhis-web-maintenance-organisationunit.jar>
[INFO] Expanding: <http://dhis.uio.no/ci/job/Dhis2%20Web%20Trunk/ws/dhis-2/dhis-web/dhis-web-commons-resources/target/dhis-web-commons-resources-2.1-SNAPSHOT.war> into <http://dhis.uio.no/ci/job/Dhis2%20Web%20Trunk/ws/dhis-2/dhis-web/dhis-web-maintenance/dhis-web-maintenance-organisationunit/target/war/work/dhis-web-commons-resources-2.1-SNAPSHOT>
[INFO] Overlaying 1 war(s).
[INFO] Generating war <http://dhis.uio.no/ci/job/Dhis2%20Web%20Trunk/ws/dhis-2/dhis-web/dhis-web-maintenance/dhis-web-maintenance-organisationunit/target/dhis-web-maintenance-organisationunit.war>
[INFO] Building war: <http://dhis.uio.no/ci/job/Dhis2%20Web%20Trunk/ws/dhis-2/dhis-web/dhis-web-maintenance/dhis-web-maintenance-organisationunit/target/dhis-web-maintenance-organisationunit.war>
[INFO] [install:install {execution: default-install}]
[INFO] Installing <http://dhis.uio.no/ci/job/Dhis2%20Web%20Trunk/ws/dhis-2/dhis-web/dhis-web-maintenance/dhis-web-maintenance-organisationunit/target/dhis-web-maintenance-organisationunit.war> to /ifi/utgard/p01/dhis/.m2/repository/org/hisp/dhis/dhis-web-maintenance-organisationunit/2.1-SNAPSHOT/dhis-web-maintenance-organisationunit-2.1-SNAPSHOT.war
[INFO] Preparing findbugs:findbugs
[HUDSON] Archiving <http://dhis.uio.no/ci/job/Dhis2%20Web%20Trunk/ws/dhis-2/dhis-web/dhis-web-maintenance/dhis-web-maintenance-organisationunit/pom.xml> to /ifi/utgard/p01/dhis/projects/dhis-dev.ifi.uio.no/ci/home/jobs/Dhis2 Web Trunk/modules/org.hisp.dhis$dhis-web-maintenance-organisationunit/builds/2011-02-25_17-47-41/archive/org.hisp.dhis/dhis-web-maintenance-organisationunit/2.1-SNAPSHOT/pom.xml
[HUDSON] Archiving <http://dhis.uio.no/ci/job/Dhis2%20Web%20Trunk/ws/dhis-2/dhis-web/dhis-web-maintenance/dhis-web-maintenance-organisationunit/target/dhis-web-maintenance-organisationunit.war> to /ifi/utgard/p01/dhis/projects/dhis-dev.ifi.uio.no/ci/home/jobs/Dhis2 Web Trunk/modules/org.hisp.dhis$dhis-web-maintenance-organisationunit/builds/2011-02-25_17-47-41/archive/org.hisp.dhis/dhis-web-maintenance-organisationunit/2.1-SNAPSHOT/dhis-web-maintenance-organisationunit.war
[INFO] [resources:resources {execution: default-resources}]
[INFO] Using encoding: 'UTF-8' to copy filtered resources.
[INFO] [compiler:compile {execution: default-compile}]
[INFO] Nothing to compile - all classes are up to date
[INFO] [findbugs:findbugs {execution: default-cli}]
[INFO] Using source root:
[INFO] <http://dhis.uio.no/ci/job/Dhis2%20Web%20Trunk/ws/dhis-2/dhis-web/dhis-web-maintenance/dhis-web-maintenance-organisationunit/target/classes>
[INFO] Using test source root:
[INFO] <http://dhis.uio.no/ci/job/Dhis2%20Web%20Trunk/ws/dhis-2/dhis-web/dhis-web-maintenance/dhis-web-maintenance-organisationunit/target/test-classes>
[INFO] No effort provided, using default effort.
[INFO] Adding Source Directory: <http://dhis.uio.no/ci/job/Dhis2%20Web%20Trunk/ws/dhis-2/dhis-web/dhis-web-maintenance/dhis-web-maintenance-organisationunit/src/main/java>
[INFO] No threshold provided, using default threshold.
[INFO] Using FindBugs Version: 1.3.8
[INFO] No threshold provided, using default threshold.
[INFO] No threshold provided, using default threshold.
[INFO] No threshold provided, using default threshold.
[INFO] Using the xdoc format
[INFO] No effort provided, using default effort.
[INFO] No threshold provided, using default threshold.
[INFO] No threshold provided, using default threshold.
[INFO] Debugging is Off
[INFO] No bug include filter.
[INFO] Using bug exclude filter /tmp/plexus-resources976439036tmp
[INFO] Printing Errors
[INFO] Printing Missing classes
[INFO] Printing Source Roots
[FINDBUGS] Parsing of file <http://dhis.uio.no/ci/job/Dhis2%20Web%20Trunk/ws/dhis-2/dhis-web/dhis-web-maintenance/dhis-web-maintenance-organisationunit/target/findbugsXml.xml> failed due to an exception:

org.xml.sax.SAXParseException: Content is not allowed in prolog.
  at com.sun.org.apache.xerces.internal.parsers.AbstractSAXParser.parse(AbstractSAXParser.java:1231)
  at com.sun.org.apache.xerces.internal.jaxp.SAXParserImpl$JAXPSAXParser.parse(SAXParserImpl.java:522)
  at org.apache.commons.digester.Digester.parse(Digester.java:1666)
  at hudson.plugins.findbugs.parser.FindBugsParser.createHashToMessageMapping(FindBugsParser.java:167)
  at hudson.plugins.findbugs.parser.FindBugsParser.parse(FindBugsParser.java:129)
  at hudson.plugins.findbugs.parser.FindBugsParser.parse(FindBugsParser.java:93)
  at hudson.plugins.analysis.core.FilesParser.parseFile(FilesParser.java:197)
  at hudson.plugins.analysis.core.FilesParser.parseFiles(FilesParser.java:176)
  at hudson.plugins.analysis.core.FilesParser.invoke(FilesParser.java:126)
  at hudson.plugins.analysis.core.FilesParser.invoke(FilesParser.java:29)
  at hudson.FilePath.act(FilePath.java:756)
  at hudson.FilePath.act(FilePath.java:738)
  at hudson.plugins.findbugs.FindBugsReporter.perform(FindBugsReporter.java:121)
  at hudson.plugins.analysis.core.HealthAwareMavenReporter.postExecute(HealthAwareMavenReporter.java:202)
  at hudson.maven.MavenModuleSetBuild$Builder.postExecute(MavenModuleSetBuild.java:946)
  at hudson.maven.MavenBuilder$Adapter.postExecute(MavenBuilder.java:336)
  at hudson.maven.agent.PluginManagerInterceptor$1MojoIntercepterImpl.callPost(PluginManagerInterceptor.java:170)
  at hudson.maven.agent.PluginManagerInterceptor.executeMojo(PluginManagerInterceptor.java:183)
  at org.apache.maven.lifecycle.DefaultLifecycleExecutor.executeGoals(DefaultLifecycleExecutor.java:694)
  at org.apache.maven.lifecycle.DefaultLifecycleExecutor.executeStandaloneGoal(DefaultLifecycleExecutor.java:569)
  at org.apache.maven.lifecycle.DefaultLifecycleExecutor.executeGoal(DefaultLifecycleExecutor.java:539)
  at org.apache.maven.lifecycle.DefaultLifecycleExecutor.executeGoalAndHandleFailures(DefaultLifecycleExecutor.java:387)
  at org.apache.maven.lifecycle.DefaultLifecycleExecutor.executeTaskSegments(DefaultLifecycleExecutor.java:348)
  at org.apache.maven.lifecycle.DefaultLifecycleExecutor.execute(DefaultLifecycleExecutor.java:180)
  at org.apache.maven.lifecycle.LifecycleExecutorInterceptor.execute(LifecycleExecutorInterceptor.java:65)
  at org.apache.maven.DefaultMaven.doExecute(DefaultMaven.java:328)
  at org.apache.maven.DefaultMaven.execute(DefaultMaven.java:138)
  at org.apache.maven.cli.MavenCli.main(MavenCli.java:362)
  at sun.reflect.NativeMethodAccessorImpl.invoke0(Native Method)
  at sun.reflect.NativeMethodAccessorImpl.invoke(NativeMethodAccessorImpl.java:39)
  at sun.reflect.DelegatingMethodAccessorImpl.invoke(DelegatingMethodAccessorImpl.java:25)
  at java.lang.reflect.Method.invoke(Method.java:597)
  at org.codehaus.classworlds.Launcher.launchEnhanced(Launcher.java:315)
  at org.codehaus.classworlds.Launcher.launch(Launcher.java:255)
  at hudson.maven.agent.Main.launch(Main.java:173)
  at hudson.maven.MavenBuilder.call(MavenBuilder.java:164)
  at hudson.maven.MavenModuleSetBuild$Builder.call(MavenModuleSetBuild.java:868)
  at hudson.maven.MavenModuleSetBuild$Builder.call(MavenModuleSetBuild.java:799)
  at hudson.remoting.UserRequest.perform(UserRequest.java:114)
  at hudson.remoting.UserRequest.perform(UserRequest.java:48)
  at hudson.remoting.Request$2.run(Request.java:270)
  at java.util.concurrent.Executors$RunnableAdapter.call(Executors.java:441)
  at java.util.concurrent.FutureTask$Sync.innerRun(FutureTask.java:303)
  at java.util.concurrent.FutureTask.run(FutureTask.java:138)
  at java.util.concurrent.ThreadPoolExecutor$Worker.runTask(ThreadPoolExecutor.java:886)
  at java.util.concurrent.ThreadPoolExecutor$Worker.run(ThreadPoolExecutor.java:908)
  at java.lang.Thread.run(Thread.java:662)

[HUDSON] Re-archiving <http://dhis.uio.no/ci/job/Dhis2%20Web%20Trunk/ws/dhis-2/dhis-web/dhis-web-maintenance/dhis-web-maintenance-organisationunit/target/dhis-web-maintenance-organisationunit.war>
[INFO] ------------------------------------------------------------------------
[INFO] Building DHIS Setting Maintenance
[INFO] task-segment: [clean, install, findbugs:findbugs]
[INFO] ------------------------------------------------------------------------
[INFO] [clean:clean {execution: default-clean}]
[INFO] Deleting directory <http://dhis.uio.no/ci/job/Dhis2%20Web%20Trunk/ws/dhis-2/dhis-web/dhis-web-maintenance/dhis-web-maintenance-settings/target>
[INFO] [resources:resources {execution: default-resources}]
[INFO] Using encoding: 'UTF-8' to copy filtered resources.
[INFO] [compiler:compile {execution: default-compile}]
[INFO] Compiling 15 source files to <http://dhis.uio.no/ci/job/Dhis2%20Web%20Trunk/ws/dhis-2/dhis-web/dhis-web-maintenance/dhis-web-maintenance-settings/target/classes>
[INFO] [resources:testResources {execution: default-testResources}]
[INFO] Using encoding: 'UTF-8' to copy filtered resources.
[INFO] [compiler:testCompile {execution: default-testCompile}]
[INFO] No sources to compile
[INFO] [surefire:test {execution: default-test}]
[INFO] No tests to run.
[HUDSON] Recording test results
[INFO] [war:war {execution: default-war}]
[INFO] Exploding webapp...
[INFO] Assembling webapp dhis-web-maintenance-settings in <http://dhis.uio.no/ci/job/Dhis2%20Web%20Trunk/ws/dhis-2/dhis-web/dhis-web-maintenance/dhis-web-maintenance-settings/target/dhis-web-maintenance-settings>
[INFO] Copy webapp webResources to <http://dhis.uio.no/ci/job/Dhis2%20Web%20Trunk/ws/dhis-2/dhis-web/dhis-web-maintenance/dhis-web-maintenance-settings/target/dhis-web-maintenance-settings>
[INFO] Building jar: <http://dhis.uio.no/ci/job/Dhis2%20Web%20Trunk/ws/dhis-2/dhis-web/dhis-web-maintenance/dhis-web-maintenance-settings/target/dhis-web-maintenance-settings/WEB-INF/lib/dhis-web-maintenance-settings.jar>
[INFO] Expanding: <http://dhis.uio.no/ci/job/Dhis2%20Web%20Trunk/ws/dhis-2/dhis-web/dhis-web-commons-resources/target/dhis-web-commons-resources-2.1-SNAPSHOT.war> into <http://dhis.uio.no/ci/job/Dhis2%20Web%20Trunk/ws/dhis-2/dhis-web/dhis-web-maintenance/dhis-web-maintenance-settings/target/war/work/dhis-web-commons-resources-2.1-SNAPSHOT>
[INFO] Overlaying 1 war(s).
[INFO] Generating war <http://dhis.uio.no/ci/job/Dhis2%20Web%20Trunk/ws/dhis-2/dhis-web/dhis-web-maintenance/dhis-web-maintenance-settings/target/dhis-web-maintenance-settings.war>
[INFO] Building war: <http://dhis.uio.no/ci/job/Dhis2%20Web%20Trunk/ws/dhis-2/dhis-web/dhis-web-maintenance/dhis-web-maintenance-settings/target/dhis-web-maintenance-settings.war>
[HUDSON] Archiving <http://dhis.uio.no/ci/job/Dhis2%20Web%20Trunk/ws/dhis-2/dhis-web/dhis-web-maintenance/dhis-web-maintenance-settings/pom.xml> to /ifi/utgard/p01/dhis/projects/dhis-dev.ifi.uio.no/ci/home/jobs/Dhis2 Web Trunk/modules/org.hisp.dhis$dhis-web-maintenance-settings/builds/2011-02-25_17-47-41/archive/org.hisp.dhis/dhis-web-maintenance-settings/2.1-SNAPSHOT/pom.xml
[INFO] ------------------------------------------------------------------------
[ERROR] BUILD ERROR
[INFO] ------------------------------------------------------------------------
[INFO] Error assembling WAR: Problem creating war: Disk quota exceeded

[INFO] ------------------------------------------------------------------------
[INFO] For more information, run Maven with the -e switch
[INFO] ------------------------------------------------------------------------
[INFO] Total time: 5 minutes 21 seconds
[INFO] Finished at: Fri Feb 25 17:53:11 CET 2011
[INFO] Final Memory: 89M/225M
[INFO] ------------------------------------------------------------------------
ERROR: Asynchronous execution failure
java.util.concurrent.ExecutionException: java.io.IOException: Disk quota exceeded
  at hudson.remoting.Channel$2.adapt(Channel.java:662)
  at hudson.remoting.Channel$2.adapt(Channel.java:657)
  at hudson.remoting.FutureAdapter.get(FutureAdapter.java:55)
  at hudson.maven.MavenBuilder.call(MavenBuilder.java:175)
  at hudson.maven.MavenModuleSetBuild$Builder.call(MavenModuleSetBuild.java:868)
  at hudson.maven.MavenModuleSetBuild$Builder.call(MavenModuleSetBuild.java:799)
  at hudson.remoting.UserRequest.perform(UserRequest.java:114)
  at hudson.remoting.UserRequest.perform(UserRequest.java:48)
  at hudson.remoting.Request$2.run(Request.java:270)
  at java.util.concurrent.Executors$RunnableAdapter.call(Executors.java:441)
  at java.util.concurrent.FutureTask$Sync.innerRun(FutureTask.java:303)
  at java.util.concurrent.FutureTask.run(FutureTask.java:138)
  at java.util.concurrent.ThreadPoolExecutor$Worker.runTask(ThreadPoolExecutor.java:886)
  at java.util.concurrent.ThreadPoolExecutor$Worker.run(ThreadPoolExecutor.java:908)
  at java.lang.Thread.run(Thread.java:662)
Caused by: java.io.IOException: Disk quota exceeded
  at java.io.FileOutputStream.close0(Native Method)
  at java.io.FileOutputStream.close(FileOutputStream.java:279)
  at sun.nio.cs.StreamEncoder.implClose(StreamEncoder.java:301)
  at sun.nio.cs.StreamEncoder.close(StreamEncoder.java:130)
  at java.io.OutputStreamWriter.close(OutputStreamWriter.java:216)
  at java.io.BufferedWriter.close(BufferedWriter.java:248)
  at hudson.util.AtomicFileWriter.close(AtomicFileWriter.java:94)
  at hudson.util.AtomicFileWriter.commit(AtomicFileWriter.java:109)
  at hudson.XmlFile.write(XmlFile.java:166)
  at hudson.model.Fingerprint.save(Fingerprint.java:704)
  at hudson.model.Fingerprint.add(Fingerprint.java:666)
  at hudson.model.Fingerprint.add(Fingerprint.java:651)
  at hudson.maven.reporters.MavenFingerprinter$1.call(MavenFingerprinter.java:107)
  at hudson.maven.reporters.MavenFingerprinter$1.call(MavenFingerprinter.java:96)
  at hudson.maven.MavenBuild$ProxyImpl.execute(MavenBuild.java:379)
  at hudson.maven.MavenBuild$ProxyImpl2.execute(MavenBuild.java:452)
  at sun.reflect.GeneratedMethodAccessor61.invoke(Unknown Source)
  at sun.reflect.DelegatingMethodAccessorImpl.invoke(DelegatingMethodAccessorImpl.java:25)
  at java.lang.reflect.Method.invoke(Method.java:597)
  at hudson.model.Executor$1.call(Executor.java:429)
  at hudson.util.InterceptingProxy$1.invoke(InterceptingProxy.java:23)
  at $Proxy28.execute(Unknown Source)
  at hudson.maven.MavenBuildProxy$Filter$AsyncInvoker.call(MavenBuildProxy.java:263)
  ... 9 more
ERROR: Asynchronous execution failure
java.util.concurrent.ExecutionException: java.io.IOException: Disk quota exceeded
  at hudson.remoting.Channel$2.adapt(Channel.java:662)
  at hudson.remoting.Channel$2.adapt(Channel.java:657)
  at hudson.remoting.FutureAdapter.get(FutureAdapter.java:55)
  at hudson.maven.MavenBuilder.call(MavenBuilder.java:175)
  at hudson.maven.MavenModuleSetBuild$Builder.call(MavenModuleSetBuild.java:868)
  at hudson.maven.MavenModuleSetBuild$Builder.call(MavenModuleSetBuild.java:799)
  at hudson.remoting.UserRequest.perform(UserRequest.java:114)
  at hudson.remoting.UserRequest.perform(UserRequest.java:48)
  at hudson.remoting.Request$2.run(Request.java:270)
  at java.util.concurrent.Executors$RunnableAdapter.call(Executors.java:441)
  at java.util.concurrent.FutureTask$Sync.innerRun(FutureTask.java:303)
  at java.util.concurrent.FutureTask.run(FutureTask.java:138)
  at java.util.concurrent.ThreadPoolExecutor$Worker.runTask(ThreadPoolExecutor.java:886)
  at java.util.concurrent.ThreadPoolExecutor$Worker.run(ThreadPoolExecutor.java:908)
  at java.lang.Thread.run(Thread.java:662)
Caused by: java.io.IOException: Disk quota exceeded
  at java.io.FileOutputStream.close0(Native Method)
  at java.io.FileOutputStream.close(FileOutputStream.java:279)
  at sun.nio.cs.StreamEncoder.implClose(StreamEncoder.java:301)
  at sun.nio.cs.StreamEncoder.close(StreamEncoder.java:130)
  at java.io.OutputStreamWriter.close(OutputStreamWriter.java:216)
  at java.io.BufferedWriter.close(BufferedWriter.java:248)
  at hudson.util.AtomicFileWriter.close(AtomicFileWriter.java:94)
  at hudson.util.AtomicFileWriter.commit(AtomicFileWriter.java:109)
  at hudson.XmlFile.write(XmlFile.java:166)
  at hudson.model.Fingerprint.save(Fingerprint.java:704)
  at hudson.model.Fingerprint.add(Fingerprint.java:666)
  at hudson.model.Fingerprint.add(Fingerprint.java:651)
  at hudson.maven.reporters.MavenFingerprinter$1.call(MavenFingerprinter.java:107)
  at hudson.maven.reporters.MavenFingerprinter$1.call(MavenFingerprinter.java:96)
  at hudson.maven.MavenBuild$ProxyImpl.execute(MavenBuild.java:379)
  at hudson.maven.MavenBuild$ProxyImpl2.execute(MavenBuild.java:452)
  at sun.reflect.GeneratedMethodAccessor61.invoke(Unknown Source)
  at sun.reflect.DelegatingMethodAccessorImpl.invoke(DelegatingMethodAccessorImpl.java:25)
  at java.lang.reflect.Method.invoke(Method.java:597)
  at hudson.model.Executor$1.call(Executor.java:429)
  at hudson.util.InterceptingProxy$1.invoke(InterceptingProxy.java:23)
  at $Proxy28.execute(Unknown Source)
  at hudson.maven.MavenBuildProxy$Filter$AsyncInvoker.call(MavenBuildProxy.java:263)
  ... 9 more
Sending e-mails to: dhis2-devs@lists.launchpad.net
channel stopped
Archiving artifacts
Performing Post build task...
Could not match :DHIS Web Portal ....................................... SUCCESS : False
Logical operation result is FALSE
Skipping script : echo "Building webapp succeeded. Deploying to dev"
/ifi/utgard/p01/dhis/bin/redeploy-dhis-snapshot
END OF POST BUILD TASK : 0
FATAL: Disk quota exceeded
java.io.IOException: Disk quota exceeded
  at java.io.FileOutputStream.close0(Native Method)
  at java.io.FileOutputStream.close(FileOutputStream.java:279)
  at sun.nio.cs.StreamEncoder.implClose(StreamEncoder.java:301)
  at sun.nio.cs.StreamEncoder.close(StreamEncoder.java:130)
  at java.io.OutputStreamWriter.close(OutputStreamWriter.java:216)
  at java.io.BufferedWriter.close(BufferedWriter.java:248)
  at hudson.util.AtomicFileWriter.close(AtomicFileWriter.java:94)
  at hudson.util.AtomicFileWriter.commit(AtomicFileWriter.java:109)
  at hudson.XmlFile.write(XmlFile.java:166)
  at hudson.model.Fingerprint.save(Fingerprint.java:704)
  at hudson.model.Fingerprint.add(Fingerprint.java:666)
  at hudson.model.Fingerprint.add(Fingerprint.java:651)
  at hudson.maven.reporters.MavenFingerprinter.aggregate(MavenFingerprinter.java:177)
  at hudson.maven.MavenModuleSetBuild$RunnerImpl.post2(MavenModuleSetBuild.java:773)
  at hudson.model.AbstractBuild$AbstractRunner.post(AbstractBuild.java:548)
  at hudson.model.Run.run(Run.java:1386)
  at hudson.maven.MavenModuleSetBuild.run(MavenModuleSetBuild.java:405)
  at hudson.model.ResourceController.execute(ResourceController.java:88)
  at hudson.model.Executor.run(Executor.java:145)

See <http://dhis.uio.no/ci/job/Dhis2%20Web%20Trunk/2068/changes>

Changes:

[Jo St?rset] Some more work-in-progress on the not so elegant web api
- can now delete complete registration by setting it to empty string..
- added hrefs to links

···

------------------------------------------
[...truncated 333 lines...]
[INFO] Using FindBugs Version: 1.3.8
[INFO] No threshold provided, using default threshold.
[INFO] No threshold provided, using default threshold.
[INFO] No threshold provided, using default threshold.
[INFO] Using the xdoc format
[INFO] No effort provided, using default effort.
[INFO] No threshold provided, using default threshold.
[INFO] No threshold provided, using default threshold.
[INFO] Debugging is Off
[INFO] No bug include filter.
[INFO] Using bug exclude filter /tmp/plexus-resources1273083353tmp
[INFO] Printing Errors
[INFO] Printing Missing classes
[INFO] Printing Source Roots
[FINDBUGS] Successfully parsed file <http://dhis.uio.no/ci/job/Dhis2%20Web%20Trunk/ws/dhis-2/dhis-web/dhis-web-maintenance/dhis-web-maintenance-datadictionary/target/findbugsXml.xml> of module DHIS Data Dictionary with 78 warnings.
[INFO] ------------------------------------------------------------------------
[INFO] Building DHIS Organisation Unit Management
[INFO] task-segment: [clean, install, findbugs:findbugs]
[INFO] ------------------------------------------------------------------------
[INFO] [clean:clean {execution: default-clean}]
[INFO] Deleting directory <http://dhis.uio.no/ci/job/Dhis2%20Web%20Trunk/ws/dhis-2/dhis-web/dhis-web-maintenance/dhis-web-maintenance-organisationunit/target>
[INFO] [resources:resources {execution: default-resources}]
[INFO] Using encoding: 'UTF-8' to copy filtered resources.
[INFO] [compiler:compile {execution: default-compile}]
[INFO] Compiling 33 source files to <http://dhis.uio.no/ci/job/Dhis2%20Web%20Trunk/ws/dhis-2/dhis-web/dhis-web-maintenance/dhis-web-maintenance-organisationunit/target/classes>
[INFO] [resources:testResources {execution: default-testResources}]
[INFO] Using encoding: 'UTF-8' to copy filtered resources.
[INFO] [compiler:testCompile {execution: default-testCompile}]
[INFO] No sources to compile
[HUDSON] Recording test results
[INFO] [surefire:test {execution: default-test}]
[INFO] No tests to run.
[INFO] [war:war {execution: default-war}]
[INFO] Exploding webapp...
[INFO] Assembling webapp dhis-web-maintenance-organisationunit in <http://dhis.uio.no/ci/job/Dhis2%20Web%20Trunk/ws/dhis-2/dhis-web/dhis-web-maintenance/dhis-web-maintenance-organisationunit/target/dhis-web-maintenance-organisationunit>
[INFO] Copy webapp webResources to <http://dhis.uio.no/ci/job/Dhis2%20Web%20Trunk/ws/dhis-2/dhis-web/dhis-web-maintenance/dhis-web-maintenance-organisationunit/target/dhis-web-maintenance-organisationunit>
[INFO] Building jar: <http://dhis.uio.no/ci/job/Dhis2%20Web%20Trunk/ws/dhis-2/dhis-web/dhis-web-maintenance/dhis-web-maintenance-organisationunit/target/dhis-web-maintenance-organisationunit/WEB-INF/lib/dhis-web-maintenance-organisationunit.jar>
[INFO] Expanding: <http://dhis.uio.no/ci/job/Dhis2%20Web%20Trunk/ws/dhis-2/dhis-web/dhis-web-commons-resources/target/dhis-web-commons-resources-2.1-SNAPSHOT.war> into <http://dhis.uio.no/ci/job/Dhis2%20Web%20Trunk/ws/dhis-2/dhis-web/dhis-web-maintenance/dhis-web-maintenance-organisationunit/target/war/work/dhis-web-commons-resources-2.1-SNAPSHOT>
[INFO] Overlaying 1 war(s).
[INFO] Generating war <http://dhis.uio.no/ci/job/Dhis2%20Web%20Trunk/ws/dhis-2/dhis-web/dhis-web-maintenance/dhis-web-maintenance-organisationunit/target/dhis-web-maintenance-organisationunit.war>
[INFO] Building war: <http://dhis.uio.no/ci/job/Dhis2%20Web%20Trunk/ws/dhis-2/dhis-web/dhis-web-maintenance/dhis-web-maintenance-organisationunit/target/dhis-web-maintenance-organisationunit.war>
[INFO] [install:install {execution: default-install}]
[INFO] Installing <http://dhis.uio.no/ci/job/Dhis2%20Web%20Trunk/ws/dhis-2/dhis-web/dhis-web-maintenance/dhis-web-maintenance-organisationunit/target/dhis-web-maintenance-organisationunit.war> to /ifi/utgard/p01/dhis/.m2/repository/org/hisp/dhis/dhis-web-maintenance-organisationunit/2.1-SNAPSHOT/dhis-web-maintenance-organisationunit-2.1-SNAPSHOT.war
[INFO] Preparing findbugs:findbugs
[HUDSON] Archiving <http://dhis.uio.no/ci/job/Dhis2%20Web%20Trunk/ws/dhis-2/dhis-web/dhis-web-maintenance/dhis-web-maintenance-organisationunit/pom.xml> to /ifi/utgard/p01/dhis/projects/dhis-dev.ifi.uio.no/ci/home/jobs/Dhis2 Web Trunk/modules/org.hisp.dhis$dhis-web-maintenance-organisationunit/builds/2011-02-25_19-47-31/archive/org.hisp.dhis/dhis-web-maintenance-organisationunit/2.1-SNAPSHOT/pom.xml
[HUDSON] Archiving <http://dhis.uio.no/ci/job/Dhis2%20Web%20Trunk/ws/dhis-2/dhis-web/dhis-web-maintenance/dhis-web-maintenance-organisationunit/target/dhis-web-maintenance-organisationunit.war> to /ifi/utgard/p01/dhis/projects/dhis-dev.ifi.uio.no/ci/home/jobs/Dhis2 Web Trunk/modules/org.hisp.dhis$dhis-web-maintenance-organisationunit/builds/2011-02-25_19-47-31/archive/org.hisp.dhis/dhis-web-maintenance-organisationunit/2.1-SNAPSHOT/dhis-web-maintenance-organisationunit.war
[INFO] [resources:resources {execution: default-resources}]
[INFO] Using encoding: 'UTF-8' to copy filtered resources.
[INFO] [compiler:compile {execution: default-compile}]
[INFO] Nothing to compile - all classes are up to date
[INFO] [findbugs:findbugs {execution: default-cli}]
[INFO] Using source root:
[INFO] <http://dhis.uio.no/ci/job/Dhis2%20Web%20Trunk/ws/dhis-2/dhis-web/dhis-web-maintenance/dhis-web-maintenance-organisationunit/target/classes>
[INFO] Using test source root:
[INFO] <http://dhis.uio.no/ci/job/Dhis2%20Web%20Trunk/ws/dhis-2/dhis-web/dhis-web-maintenance/dhis-web-maintenance-organisationunit/target/test-classes>
[INFO] No effort provided, using default effort.
[INFO] Adding Source Directory: <http://dhis.uio.no/ci/job/Dhis2%20Web%20Trunk/ws/dhis-2/dhis-web/dhis-web-maintenance/dhis-web-maintenance-organisationunit/src/main/java>
[INFO] No threshold provided, using default threshold.
[INFO] Using FindBugs Version: 1.3.8
[INFO] No threshold provided, using default threshold.
[INFO] No threshold provided, using default threshold.
[INFO] No threshold provided, using default threshold.
[INFO] Using the xdoc format
[INFO] No effort provided, using default effort.
[INFO] No threshold provided, using default threshold.
[INFO] No threshold provided, using default threshold.
[INFO] Debugging is Off
[INFO] No bug include filter.
[INFO] Using bug exclude filter /tmp/plexus-resources2098731467tmp
[INFO] Printing Errors
[INFO] Printing Missing classes
[INFO] Printing Source Roots
[FINDBUGS] Skipping file DHIS Organisation Unit Management of module <http://dhis.uio.no/ci/job/Dhis2%20Web%20Trunk/ws/dhis-2/dhis-web/dhis-web-maintenance/dhis-web-maintenance-organisationunit/target/findbugsXml.xml> because it's empty.
[HUDSON] Re-archiving <http://dhis.uio.no/ci/job/Dhis2%20Web%20Trunk/ws/dhis-2/dhis-web/dhis-web-maintenance/dhis-web-maintenance-organisationunit/target/dhis-web-maintenance-organisationunit.war>
[INFO] ------------------------------------------------------------------------
[INFO] Building DHIS Setting Maintenance
[INFO] task-segment: [clean, install, findbugs:findbugs]
[INFO] ------------------------------------------------------------------------
[INFO] [clean:clean {execution: default-clean}]
[INFO] Deleting directory <http://dhis.uio.no/ci/job/Dhis2%20Web%20Trunk/ws/dhis-2/dhis-web/dhis-web-maintenance/dhis-web-maintenance-settings/target>
[INFO] [resources:resources {execution: default-resources}]
[INFO] Using encoding: 'UTF-8' to copy filtered resources.
[INFO] [compiler:compile {execution: default-compile}]
[INFO] Compiling 15 source files to <http://dhis.uio.no/ci/job/Dhis2%20Web%20Trunk/ws/dhis-2/dhis-web/dhis-web-maintenance/dhis-web-maintenance-settings/target/classes>
[INFO] [resources:testResources {execution: default-testResources}]
[INFO] Using encoding: 'UTF-8' to copy filtered resources.
[INFO] [compiler:testCompile {execution: default-testCompile}]
[INFO] No sources to compile
[INFO] [surefire:test {execution: default-test}]
[INFO] No tests to run.
[HUDSON] Recording test results
[INFO] [war:war {execution: default-war}]
[INFO] Exploding webapp...
[INFO] Assembling webapp dhis-web-maintenance-settings in <http://dhis.uio.no/ci/job/Dhis2%20Web%20Trunk/ws/dhis-2/dhis-web/dhis-web-maintenance/dhis-web-maintenance-settings/target/dhis-web-maintenance-settings>
[INFO] Copy webapp webResources to <http://dhis.uio.no/ci/job/Dhis2%20Web%20Trunk/ws/dhis-2/dhis-web/dhis-web-maintenance/dhis-web-maintenance-settings/target/dhis-web-maintenance-settings>
[INFO] Building jar: <http://dhis.uio.no/ci/job/Dhis2%20Web%20Trunk/ws/dhis-2/dhis-web/dhis-web-maintenance/dhis-web-maintenance-settings/target/dhis-web-maintenance-settings/WEB-INF/lib/dhis-web-maintenance-settings.jar>
[INFO] Expanding: <http://dhis.uio.no/ci/job/Dhis2%20Web%20Trunk/ws/dhis-2/dhis-web/dhis-web-commons-resources/target/dhis-web-commons-resources-2.1-SNAPSHOT.war> into <http://dhis.uio.no/ci/job/Dhis2%20Web%20Trunk/ws/dhis-2/dhis-web/dhis-web-maintenance/dhis-web-maintenance-settings/target/war/work/dhis-web-commons-resources-2.1-SNAPSHOT>
[INFO] Overlaying 1 war(s).
[HUDSON] Archiving <http://dhis.uio.no/ci/job/Dhis2%20Web%20Trunk/ws/dhis-2/dhis-web/dhis-web-maintenance/dhis-web-maintenance-settings/pom.xml> to /ifi/utgard/p01/dhis/projects/dhis-dev.ifi.uio.no/ci/home/jobs/Dhis2 Web Trunk/modules/org.hisp.dhis$dhis-web-maintenance-settings/builds/2011-02-25_19-47-31/archive/org.hisp.dhis/dhis-web-maintenance-settings/2.1-SNAPSHOT/pom.xml
[INFO] ------------------------------------------------------------------------
[ERROR] BUILD ERROR
[INFO] ------------------------------------------------------------------------
[INFO] Error copying file 'dhis-web-commons/useraccount/updateUserSuccess.vm' to '<http://dhis.uio.no/ci/job/Dhis2%20Web%20Trunk/ws/dhis-2/dhis-web/dhis-web-maintenance/dhis-web-maintenance-settings/target/dhis-web-maintenance-settings/dhis-web-commons/useraccount/updateUserSuccess.vm'>

Embedded error: Disk quota exceeded
[INFO] ------------------------------------------------------------------------
[INFO] For more information, run Maven with the -e switch
[INFO] ------------------------------------------------------------------------
[INFO] Total time: 5 minutes 4 seconds
[INFO] Finished at: Fri Feb 25 19:52:43 CET 2011
[INFO] Final Memory: 90M/226M
[INFO] ------------------------------------------------------------------------
ERROR: Asynchronous execution failure
java.util.concurrent.ExecutionException: java.io.IOException: Disk quota exceeded
  at hudson.remoting.Channel$2.adapt(Channel.java:662)
  at hudson.remoting.Channel$2.adapt(Channel.java:657)
  at hudson.remoting.FutureAdapter.get(FutureAdapter.java:55)
  at hudson.maven.MavenBuilder.call(MavenBuilder.java:175)
  at hudson.maven.MavenModuleSetBuild$Builder.call(MavenModuleSetBuild.java:868)
  at hudson.maven.MavenModuleSetBuild$Builder.call(MavenModuleSetBuild.java:799)
  at hudson.remoting.UserRequest.perform(UserRequest.java:114)
  at hudson.remoting.UserRequest.perform(UserRequest.java:48)
  at hudson.remoting.Request$2.run(Request.java:270)
  at java.util.concurrent.Executors$RunnableAdapter.call(Executors.java:441)
  at java.util.concurrent.FutureTask$Sync.innerRun(FutureTask.java:303)
  at java.util.concurrent.FutureTask.run(FutureTask.java:138)
  at java.util.concurrent.ThreadPoolExecutor$Worker.runTask(ThreadPoolExecutor.java:886)
  at java.util.concurrent.ThreadPoolExecutor$Worker.run(ThreadPoolExecutor.java:908)
  at java.lang.Thread.run(Thread.java:662)
Caused by: java.io.IOException: Disk quota exceeded
  at java.io.FileOutputStream.close0(Native Method)
  at java.io.FileOutputStream.close(FileOutputStream.java:279)
  at sun.nio.cs.StreamEncoder.implClose(StreamEncoder.java:301)
  at sun.nio.cs.StreamEncoder.close(StreamEncoder.java:130)
  at java.io.OutputStreamWriter.close(OutputStreamWriter.java:216)
  at java.io.BufferedWriter.close(BufferedWriter.java:248)
  at hudson.util.AtomicFileWriter.close(AtomicFileWriter.java:94)
  at hudson.util.AtomicFileWriter.commit(AtomicFileWriter.java:109)
  at hudson.XmlFile.write(XmlFile.java:166)
  at hudson.model.Fingerprint.save(Fingerprint.java:704)
  at hudson.model.Fingerprint.add(Fingerprint.java:666)
  at hudson.model.Fingerprint.add(Fingerprint.java:651)
  at hudson.maven.reporters.MavenFingerprinter$1.call(MavenFingerprinter.java:107)
  at hudson.maven.reporters.MavenFingerprinter$1.call(MavenFingerprinter.java:96)
  at hudson.maven.MavenBuild$ProxyImpl.execute(MavenBuild.java:379)
  at hudson.maven.MavenBuild$ProxyImpl2.execute(MavenBuild.java:452)
  at sun.reflect.GeneratedMethodAccessor61.invoke(Unknown Source)
  at sun.reflect.DelegatingMethodAccessorImpl.invoke(DelegatingMethodAccessorImpl.java:25)
  at java.lang.reflect.Method.invoke(Method.java:597)
  at hudson.model.Executor$1.call(Executor.java:429)
  at hudson.util.InterceptingProxy$1.invoke(InterceptingProxy.java:23)
  at $Proxy28.execute(Unknown Source)
  at hudson.maven.MavenBuildProxy$Filter$AsyncInvoker.call(MavenBuildProxy.java:263)
  ... 9 more
ERROR: Asynchronous execution failure
java.util.concurrent.ExecutionException: java.io.IOException: Disk quota exceeded
  at hudson.remoting.Channel$2.adapt(Channel.java:662)
  at hudson.remoting.Channel$2.adapt(Channel.java:657)
  at hudson.remoting.FutureAdapter.get(FutureAdapter.java:55)
  at hudson.maven.MavenBuilder.call(MavenBuilder.java:175)
  at hudson.maven.MavenModuleSetBuild$Builder.call(MavenModuleSetBuild.java:868)
  at hudson.maven.MavenModuleSetBuild$Builder.call(MavenModuleSetBuild.java:799)
  at hudson.remoting.UserRequest.perform(UserRequest.java:114)
  at hudson.remoting.UserRequest.perform(UserRequest.java:48)
  at hudson.remoting.Request$2.run(Request.java:270)
  at java.util.concurrent.Executors$RunnableAdapter.call(Executors.java:441)
  at java.util.concurrent.FutureTask$Sync.innerRun(FutureTask.java:303)
  at java.util.concurrent.FutureTask.run(FutureTask.java:138)
  at java.util.concurrent.ThreadPoolExecutor$Worker.runTask(ThreadPoolExecutor.java:886)
  at java.util.concurrent.ThreadPoolExecutor$Worker.run(ThreadPoolExecutor.java:908)
  at java.lang.Thread.run(Thread.java:662)
Caused by: java.io.IOException: Disk quota exceeded
  at java.io.FileOutputStream.close0(Native Method)
  at java.io.FileOutputStream.close(FileOutputStream.java:279)
  at sun.nio.cs.StreamEncoder.implClose(StreamEncoder.java:301)
  at sun.nio.cs.StreamEncoder.close(StreamEncoder.java:130)
  at java.io.OutputStreamWriter.close(OutputStreamWriter.java:216)
  at java.io.BufferedWriter.close(BufferedWriter.java:248)
  at hudson.util.AtomicFileWriter.close(AtomicFileWriter.java:94)
  at hudson.util.AtomicFileWriter.commit(AtomicFileWriter.java:109)
  at hudson.XmlFile.write(XmlFile.java:166)
  at hudson.model.Fingerprint.save(Fingerprint.java:704)
  at hudson.model.Fingerprint.add(Fingerprint.java:666)
  at hudson.model.Fingerprint.add(Fingerprint.java:651)
  at hudson.maven.reporters.MavenFingerprinter$1.call(MavenFingerprinter.java:107)
  at hudson.maven.reporters.MavenFingerprinter$1.call(MavenFingerprinter.java:96)
  at hudson.maven.MavenBuild$ProxyImpl.execute(MavenBuild.java:379)
  at hudson.maven.MavenBuild$ProxyImpl2.execute(MavenBuild.java:452)
  at sun.reflect.GeneratedMethodAccessor61.invoke(Unknown Source)
  at sun.reflect.DelegatingMethodAccessorImpl.invoke(DelegatingMethodAccessorImpl.java:25)
  at java.lang.reflect.Method.invoke(Method.java:597)
  at hudson.model.Executor$1.call(Executor.java:429)
  at hudson.util.InterceptingProxy$1.invoke(InterceptingProxy.java:23)
  at $Proxy28.execute(Unknown Source)
  at hudson.maven.MavenBuildProxy$Filter$AsyncInvoker.call(MavenBuildProxy.java:263)
  ... 9 more
ERROR: Asynchronous execution failure
java.util.concurrent.ExecutionException: java.io.IOException: Disk quota exceeded
  at hudson.remoting.Channel$2.adapt(Channel.java:662)
  at hudson.remoting.Channel$2.adapt(Channel.java:657)
  at hudson.remoting.FutureAdapter.get(FutureAdapter.java:55)
  at hudson.maven.MavenBuilder.call(MavenBuilder.java:175)
  at hudson.maven.MavenModuleSetBuild$Builder.call(MavenModuleSetBuild.java:868)
  at hudson.maven.MavenModuleSetBuild$Builder.call(MavenModuleSetBuild.java:799)
  at hudson.remoting.UserRequest.perform(UserRequest.java:114)
  at hudson.remoting.UserRequest.perform(UserRequest.java:48)
  at hudson.remoting.Request$2.run(Request.java:270)
  at java.util.concurrent.Executors$RunnableAdapter.call(Executors.java:441)
  at java.util.concurrent.FutureTask$Sync.innerRun(FutureTask.java:303)
  at java.util.concurrent.FutureTask.run(FutureTask.java:138)
  at java.util.concurrent.ThreadPoolExecutor$Worker.runTask(ThreadPoolExecutor.java:886)
  at java.util.concurrent.ThreadPoolExecutor$Worker.run(ThreadPoolExecutor.java:908)
  at java.lang.Thread.run(Thread.java:662)
Caused by: java.io.IOException: Disk quota exceeded
  at java.io.FileOutputStream.close0(Native Method)
  at java.io.FileOutputStream.close(FileOutputStream.java:279)
  at sun.nio.cs.StreamEncoder.implClose(StreamEncoder.java:301)
  at sun.nio.cs.StreamEncoder.close(StreamEncoder.java:130)
  at java.io.OutputStreamWriter.close(OutputStreamWriter.java:216)
  at java.io.BufferedWriter.close(BufferedWriter.java:248)
  at hudson.util.AtomicFileWriter.close(AtomicFileWriter.java:94)
  at hudson.util.AtomicFileWriter.commit(AtomicFileWriter.java:109)
  at hudson.XmlFile.write(XmlFile.java:166)
  at hudson.model.Fingerprint.save(Fingerprint.java:704)
  at hudson.model.Fingerprint.add(Fingerprint.java:666)
  at hudson.model.Fingerprint.add(Fingerprint.java:651)
  at hudson.maven.reporters.MavenFingerprinter$1.call(MavenFingerprinter.java:105)
  at hudson.maven.reporters.MavenFingerprinter$1.call(MavenFingerprinter.java:96)
  at hudson.maven.MavenBuild$ProxyImpl.execute(MavenBuild.java:379)
  at hudson.maven.MavenBuild$ProxyImpl2.execute(MavenBuild.java:452)
  at sun.reflect.GeneratedMethodAccessor61.invoke(Unknown Source)
  at sun.reflect.DelegatingMethodAccessorImpl.invoke(DelegatingMethodAccessorImpl.java:25)
  at java.lang.reflect.Method.invoke(Method.java:597)
  at hudson.model.Executor$1.call(Executor.java:429)
  at hudson.util.InterceptingProxy$1.invoke(InterceptingProxy.java:23)
  at $Proxy28.execute(Unknown Source)
  at hudson.maven.MavenBuildProxy$Filter$AsyncInvoker.call(MavenBuildProxy.java:263)
  ... 9 more
Sending e-mails to: dhis2-devs@lists.launchpad.net
channel stopped
Archiving artifacts
Performing Post build task...
Could not match :DHIS Web Portal ....................................... SUCCESS : False
Logical operation result is FALSE
Skipping script : echo "Building webapp succeeded. Deploying to dev"
/ifi/utgard/p01/dhis/bin/redeploy-dhis-snapshot
END OF POST BUILD TASK : 0
Failed to send e-mail to Jo St?rset because no e-mail address is known, and no default e-mail domain is configured
Failed to send e-mail to Jan Henrik Overland because no e-mail address is known, and no default e-mail domain is configured

See <http://dhis.uio.no/ci/job/Dhis2%20Web%20Trunk/2069/changes>

Changes:

[Jan Henrik Overland] Some view history improvements. Restricted to show last 20 views.

···

------------------------------------------
[...truncated 996 lines...]
[INFO] Exploding webapp...
[INFO] Assembling webapp dhis-web-dashboard-integration in <http://dhis.uio.no/ci/job/Dhis2%20Web%20Trunk/ws/dhis-2/dhis-web/dhis-web-dashboard-integration/target/dhis-web-dashboard-integration>
[INFO] Copy webapp webResources to <http://dhis.uio.no/ci/job/Dhis2%20Web%20Trunk/ws/dhis-2/dhis-web/dhis-web-dashboard-integration/target/dhis-web-dashboard-integration>
[INFO] Building jar: <http://dhis.uio.no/ci/job/Dhis2%20Web%20Trunk/ws/dhis-2/dhis-web/dhis-web-dashboard-integration/target/dhis-web-dashboard-integration/WEB-INF/lib/dhis-web-dashboard-integration.jar>
[INFO] Expanding: <http://dhis.uio.no/ci/job/Dhis2%20Web%20Trunk/ws/dhis-2/dhis-web/dhis-web-commons-resources/target/dhis-web-commons-resources-2.1-SNAPSHOT.war> into <http://dhis.uio.no/ci/job/Dhis2%20Web%20Trunk/ws/dhis-2/dhis-web/dhis-web-dashboard-integration/target/war/work/dhis-web-commons-resources-2.1-SNAPSHOT>
[INFO] Overlaying 1 war(s).
[INFO] Generating war <http://dhis.uio.no/ci/job/Dhis2%20Web%20Trunk/ws/dhis-2/dhis-web/dhis-web-dashboard-integration/target/dhis-web-dashboard-integration.war>
[INFO] Building war: <http://dhis.uio.no/ci/job/Dhis2%20Web%20Trunk/ws/dhis-2/dhis-web/dhis-web-dashboard-integration/target/dhis-web-dashboard-integration.war>
[INFO] [install:install {execution: default-install}]
[INFO] Installing <http://dhis.uio.no/ci/job/Dhis2%20Web%20Trunk/ws/dhis-2/dhis-web/dhis-web-dashboard-integration/target/dhis-web-dashboard-integration.war> to /ifi/utgard/p01/dhis/.m2/repository/org/hisp/dhis/dhis-web-dashboard-integration/2.1-SNAPSHOT/dhis-web-dashboard-integration-2.1-SNAPSHOT.war
[INFO] Preparing findbugs:findbugs
[HUDSON] Archiving <http://dhis.uio.no/ci/job/Dhis2%20Web%20Trunk/ws/dhis-2/dhis-web/dhis-web-dashboard-integration/pom.xml> to /ifi/utgard/p01/dhis/projects/dhis-dev.ifi.uio.no/ci/home/jobs/Dhis2 Web Trunk/modules/org.hisp.dhis$dhis-web-dashboard-integration/builds/2011-02-25_20-47-56/archive/org.hisp.dhis/dhis-web-dashboard-integration/2.1-SNAPSHOT/pom.xml
[HUDSON] Archiving <http://dhis.uio.no/ci/job/Dhis2%20Web%20Trunk/ws/dhis-2/dhis-web/dhis-web-dashboard-integration/target/dhis-web-dashboard-integration.war> to /ifi/utgard/p01/dhis/projects/dhis-dev.ifi.uio.no/ci/home/jobs/Dhis2 Web Trunk/modules/org.hisp.dhis$dhis-web-dashboard-integration/builds/2011-02-25_20-47-56/archive/org.hisp.dhis/dhis-web-dashboard-integration/2.1-SNAPSHOT/dhis-web-dashboard-integration.war
[INFO] [resources:resources {execution: default-resources}]
[INFO] Using encoding: 'UTF-8' to copy filtered resources.
[INFO] [compiler:compile {execution: default-compile}]
[INFO] Nothing to compile - all classes are up to date
[INFO] [findbugs:findbugs {execution: default-cli}]
[INFO] Using source root:
[INFO] <http://dhis.uio.no/ci/job/Dhis2%20Web%20Trunk/ws/dhis-2/dhis-web/dhis-web-dashboard-integration/target/classes>
[INFO] Using test source root:
[INFO] <http://dhis.uio.no/ci/job/Dhis2%20Web%20Trunk/ws/dhis-2/dhis-web/dhis-web-dashboard-integration/target/test-classes>
[INFO] No effort provided, using default effort.
[INFO] Adding Source Directory: <http://dhis.uio.no/ci/job/Dhis2%20Web%20Trunk/ws/dhis-2/dhis-web/dhis-web-dashboard-integration/src/main/java>
[INFO] No threshold provided, using default threshold.
[INFO] Using FindBugs Version: 1.3.8
[INFO] No threshold provided, using default threshold.
[INFO] No threshold provided, using default threshold.
[INFO] No threshold provided, using default threshold.
[INFO] Using the xdoc format
[INFO] No effort provided, using default effort.
[INFO] No threshold provided, using default threshold.
[INFO] No threshold provided, using default threshold.
[INFO] Debugging is Off
[INFO] No bug include filter.
[INFO] Using bug exclude filter /tmp/plexus-resources1623905965tmp
[INFO] Printing Errors
[INFO] Printing Missing classes
[INFO] Printing Source Roots
[FINDBUGS] Successfully parsed file <http://dhis.uio.no/ci/job/Dhis2%20Web%20Trunk/ws/dhis-2/dhis-web/dhis-web-dashboard-integration/target/findbugsXml.xml> of module DHIS Web Dashboard Integration module with 1 warnings.
[INFO] ------------------------------------------------------------------------
[INFO] Building DHIS Case Entry
[INFO] task-segment: [clean, install, findbugs:findbugs]
[INFO] ------------------------------------------------------------------------
[INFO] [clean:clean {execution: default-clean}]
[INFO] Deleting directory <http://dhis.uio.no/ci/job/Dhis2%20Web%20Trunk/ws/dhis-2/dhis-web/dhis-web-caseentry/target>
[INFO] [resources:resources {execution: default-resources}]
[INFO] Using encoding: 'UTF-8' to copy filtered resources.
[INFO] [compiler:compile {execution: default-compile}]
[INFO] Compiling 36 source files to <http://dhis.uio.no/ci/job/Dhis2%20Web%20Trunk/ws/dhis-2/dhis-web/dhis-web-caseentry/target/classes>
[INFO] [resources:testResources {execution: default-testResources}]
[INFO] Using encoding: 'UTF-8' to copy filtered resources.
[INFO] [compiler:testCompile {execution: default-testCompile}]
[INFO] No sources to compile
[INFO] [surefire:test {execution: default-test}]
[INFO] No tests to run.
[HUDSON] Recording test results
[INFO] [war:war {execution: default-war}]
[INFO] Exploding webapp...
[INFO] Assembling webapp dhis-web-caseentry in <http://dhis.uio.no/ci/job/Dhis2%20Web%20Trunk/ws/dhis-2/dhis-web/dhis-web-caseentry/target/dhis-web-caseentry>
[INFO] Copy webapp webResources to <http://dhis.uio.no/ci/job/Dhis2%20Web%20Trunk/ws/dhis-2/dhis-web/dhis-web-caseentry/target/dhis-web-caseentry>
[INFO] Building jar: <http://dhis.uio.no/ci/job/Dhis2%20Web%20Trunk/ws/dhis-2/dhis-web/dhis-web-caseentry/target/dhis-web-caseentry/WEB-INF/lib/dhis-web-caseentry.jar>
[INFO] Expanding: <http://dhis.uio.no/ci/job/Dhis2%20Web%20Trunk/ws/dhis-2/dhis-web/dhis-web-commons-resources/target/dhis-web-commons-resources-2.1-SNAPSHOT.war> into <http://dhis.uio.no/ci/job/Dhis2%20Web%20Trunk/ws/dhis-2/dhis-web/dhis-web-caseentry/target/war/work/dhis-web-commons-resources-2.1-SNAPSHOT>
[INFO] Overlaying 1 war(s).
[INFO] Generating war <http://dhis.uio.no/ci/job/Dhis2%20Web%20Trunk/ws/dhis-2/dhis-web/dhis-web-caseentry/target/dhis-web-caseentry.war>
[INFO] Building war: <http://dhis.uio.no/ci/job/Dhis2%20Web%20Trunk/ws/dhis-2/dhis-web/dhis-web-caseentry/target/dhis-web-caseentry.war>
[INFO] [install:install {execution: default-install}]
[INFO] Installing <http://dhis.uio.no/ci/job/Dhis2%20Web%20Trunk/ws/dhis-2/dhis-web/dhis-web-caseentry/target/dhis-web-caseentry.war> to /ifi/utgard/p01/dhis/.m2/repository/org/hisp/dhis/dhis-web-caseentry/2.1-SNAPSHOT/dhis-web-caseentry-2.1-SNAPSHOT.war
[INFO] Preparing findbugs:findbugs
[HUDSON] Archiving <http://dhis.uio.no/ci/job/Dhis2%20Web%20Trunk/ws/dhis-2/dhis-web/dhis-web-caseentry/pom.xml> to /ifi/utgard/p01/dhis/projects/dhis-dev.ifi.uio.no/ci/home/jobs/Dhis2 Web Trunk/modules/org.hisp.dhis$dhis-web-caseentry/builds/2011-02-25_20-47-56/archive/org.hisp.dhis/dhis-web-caseentry/2.1-SNAPSHOT/pom.xml
[HUDSON] Archiving <http://dhis.uio.no/ci/job/Dhis2%20Web%20Trunk/ws/dhis-2/dhis-web/dhis-web-caseentry/target/dhis-web-caseentry.war> to /ifi/utgard/p01/dhis/projects/dhis-dev.ifi.uio.no/ci/home/jobs/Dhis2 Web Trunk/modules/org.hisp.dhis$dhis-web-caseentry/builds/2011-02-25_20-47-56/archive/org.hisp.dhis/dhis-web-caseentry/2.1-SNAPSHOT/dhis-web-caseentry.war
[INFO] [resources:resources {execution: default-resources}]
[INFO] Using encoding: 'UTF-8' to copy filtered resources.
[INFO] [compiler:compile {execution: default-compile}]
[INFO] Nothing to compile - all classes are up to date
[INFO] [findbugs:findbugs {execution: default-cli}]
[INFO] Using source root:
[INFO] <http://dhis.uio.no/ci/job/Dhis2%20Web%20Trunk/ws/dhis-2/dhis-web/dhis-web-caseentry/target/classes>
[INFO] Using test source root:
[INFO] <http://dhis.uio.no/ci/job/Dhis2%20Web%20Trunk/ws/dhis-2/dhis-web/dhis-web-caseentry/target/test-classes>
[INFO] No effort provided, using default effort.
[INFO] Adding Source Directory: <http://dhis.uio.no/ci/job/Dhis2%20Web%20Trunk/ws/dhis-2/dhis-web/dhis-web-caseentry/src/main/java>
[INFO] No threshold provided, using default threshold.
[INFO] Using FindBugs Version: 1.3.8
[INFO] No threshold provided, using default threshold.
[INFO] No threshold provided, using default threshold.
[INFO] No threshold provided, using default threshold.
[INFO] Using the xdoc format
[INFO] No effort provided, using default effort.
[INFO] No threshold provided, using default threshold.
[INFO] No threshold provided, using default threshold.
[INFO] Debugging is Off
[INFO] No bug include filter.
[INFO] Using bug exclude filter /tmp/plexus-resources1475855350tmp
[INFO] Printing Errors
[INFO] Printing Missing classes
[INFO] Printing Source Roots
[FINDBUGS] Skipping file DHIS Case Entry of module <http://dhis.uio.no/ci/job/Dhis2%20Web%20Trunk/ws/dhis-2/dhis-web/dhis-web-caseentry/target/findbugsXml.xml> because it's empty.
[HUDSON] Re-archiving <http://dhis.uio.no/ci/job/Dhis2%20Web%20Trunk/ws/dhis-2/dhis-web/dhis-web-caseentry/target/dhis-web-caseentry.war>
[INFO] ------------------------------------------------------------------------
[INFO] Building DHIS Web API
[INFO] task-segment: [clean, install, findbugs:findbugs]
[INFO] ------------------------------------------------------------------------
[INFO] [clean:clean {execution: default-clean}]
[INFO] Deleting directory <http://dhis.uio.no/ci/job/Dhis2%20Web%20Trunk/ws/dhis-2/dhis-web/dhis-web-api/target>
[INFO] [resources:resources {execution: default-resources}]
[INFO] Using encoding: 'UTF-8' to copy filtered resources.
[INFO] [compiler:compile {execution: default-compile}]
[INFO] Compiling 50 source files to <http://dhis.uio.no/ci/job/Dhis2%20Web%20Trunk/ws/dhis-2/dhis-web/dhis-web-api/target/classes>
[INFO] [resources:testResources {execution: default-testResources}]
[INFO] Using encoding: 'UTF-8' to copy filtered resources.
[INFO] [compiler:testCompile {execution: default-testCompile}]
[INFO] Compiling 3 source files to <http://dhis.uio.no/ci/job/Dhis2%20Web%20Trunk/ws/dhis-2/dhis-web/dhis-web-api/target/test-classes>
[INFO] [surefire:test {execution: default-test}]
[INFO] Surefire report directory: <http://dhis.uio.no/ci/job/Dhis2%20Web%20Trunk/ws/dhis-2/dhis-web/dhis-web-api/target/surefire-reports>

-------------------------------------------------------
T E S T S
-------------------------------------------------------
Running org.hisp.dhis.web.api.provider.DataStreamSerializableProviderTest
Tests run: 1, Failures: 0, Errors: 0, Skipped: 0, Time elapsed: 0.163 sec
Running org.hisp.dhis.web.api.model.OrgUnitTest
Tests run: 1, Failures: 0, Errors: 0, Skipped: 0, Time elapsed: 0.011 sec
Running org.hisp.dhis.web.api.model.OrgUnitsTest
Tests run: 1, Failures: 0, Errors: 0, Skipped: 0, Time elapsed: 0.01 sec

Results :

Tests run: 3, Failures: 0, Errors: 0, Skipped: 0

[HUDSON] Recording test results
[INFO] [war:war {execution: default-war}]
[INFO] Exploding webapp...
[INFO] Assembling webapp dhis-web-api in <http://dhis.uio.no/ci/job/Dhis2%20Web%20Trunk/ws/dhis-2/dhis-web/dhis-web-api/target/dhis-web-api>
[INFO] Copy webapp webResources to <http://dhis.uio.no/ci/job/Dhis2%20Web%20Trunk/ws/dhis-2/dhis-web/dhis-web-api/target/dhis-web-api>
[INFO] Building jar: <http://dhis.uio.no/ci/job/Dhis2%20Web%20Trunk/ws/dhis-2/dhis-web/dhis-web-api/target/dhis-web-api/WEB-INF/lib/dhis-web-api.jar>
[INFO] Expanding: <http://dhis.uio.no/ci/job/Dhis2%20Web%20Trunk/ws/dhis-2/dhis-web/dhis-web-commons-resources/target/dhis-web-commons-resources-2.1-SNAPSHOT.war> into <http://dhis.uio.no/ci/job/Dhis2%20Web%20Trunk/ws/dhis-2/dhis-web/dhis-web-api/target/war/work/dhis-web-commons-resources-2.1-SNAPSHOT>
[INFO] Overlaying 1 war(s).
[INFO] Generating war <http://dhis.uio.no/ci/job/Dhis2%20Web%20Trunk/ws/dhis-2/dhis-web/dhis-web-api/target/dhis-web-api.war>
[INFO] Building war: <http://dhis.uio.no/ci/job/Dhis2%20Web%20Trunk/ws/dhis-2/dhis-web/dhis-web-api/target/dhis-web-api.war>
[HUDSON] Archiving <http://dhis.uio.no/ci/job/Dhis2%20Web%20Trunk/ws/dhis-2/dhis-web/dhis-web-api/pom.xml> to /ifi/utgard/p01/dhis/projects/dhis-dev.ifi.uio.no/ci/home/jobs/Dhis2 Web Trunk/modules/org.hisp.dhis$dhis-web-api/builds/2011-02-25_20-47-56/archive/org.hisp.dhis/dhis-web-api/2.1-SNAPSHOT/pom.xml
[INFO] ------------------------------------------------------------------------
[ERROR] BUILD ERROR
[INFO] ------------------------------------------------------------------------
[INFO] Error assembling WAR: Problem creating war: Disk quota exceeded

[INFO] ------------------------------------------------------------------------
[INFO] For more information, run Maven with the -e switch
[INFO] ------------------------------------------------------------------------
[INFO] Total time: 14 minutes 8 seconds
[INFO] Finished at: Fri Feb 25 21:02:11 CET 2011
[INFO] Final Memory: 217M/518M
[INFO] ------------------------------------------------------------------------
ERROR: Asynchronous execution failure
java.util.concurrent.ExecutionException: java.io.IOException: Disk quota exceeded
  at hudson.remoting.Channel$2.adapt(Channel.java:662)
  at hudson.remoting.Channel$2.adapt(Channel.java:657)
  at hudson.remoting.FutureAdapter.get(FutureAdapter.java:55)
  at hudson.maven.MavenBuilder.call(MavenBuilder.java:175)
  at hudson.maven.MavenModuleSetBuild$Builder.call(MavenModuleSetBuild.java:868)
  at hudson.maven.MavenModuleSetBuild$Builder.call(MavenModuleSetBuild.java:799)
  at hudson.remoting.UserRequest.perform(UserRequest.java:114)
  at hudson.remoting.UserRequest.perform(UserRequest.java:48)
  at hudson.remoting.Request$2.run(Request.java:270)
  at java.util.concurrent.Executors$RunnableAdapter.call(Executors.java:441)
  at java.util.concurrent.FutureTask$Sync.innerRun(FutureTask.java:303)
  at java.util.concurrent.FutureTask.run(FutureTask.java:138)
  at java.util.concurrent.ThreadPoolExecutor$Worker.runTask(ThreadPoolExecutor.java:886)
  at java.util.concurrent.ThreadPoolExecutor$Worker.run(ThreadPoolExecutor.java:908)
  at java.lang.Thread.run(Thread.java:662)
Caused by: java.io.IOException: Disk quota exceeded
  at java.io.FileOutputStream.close0(Native Method)
  at java.io.FileOutputStream.close(FileOutputStream.java:279)
  at sun.nio.cs.StreamEncoder.implClose(StreamEncoder.java:301)
  at sun.nio.cs.StreamEncoder.close(StreamEncoder.java:130)
  at java.io.OutputStreamWriter.close(OutputStreamWriter.java:216)
  at java.io.BufferedWriter.close(BufferedWriter.java:248)
  at hudson.util.AtomicFileWriter.close(AtomicFileWriter.java:94)
  at hudson.util.AtomicFileWriter.commit(AtomicFileWriter.java:109)
  at hudson.XmlFile.write(XmlFile.java:166)
  at hudson.model.Fingerprint.save(Fingerprint.java:704)
  at hudson.model.Fingerprint.add(Fingerprint.java:666)
  at hudson.model.Fingerprint.add(Fingerprint.java:651)
  at hudson.maven.reporters.MavenFingerprinter$1.call(MavenFingerprinter.java:107)
  at hudson.maven.reporters.MavenFingerprinter$1.call(MavenFingerprinter.java:96)
  at hudson.maven.MavenBuild$ProxyImpl.execute(MavenBuild.java:379)
  at hudson.maven.MavenBuild$ProxyImpl2.execute(MavenBuild.java:452)
  at sun.reflect.GeneratedMethodAccessor61.invoke(Unknown Source)
  at sun.reflect.DelegatingMethodAccessorImpl.invoke(DelegatingMethodAccessorImpl.java:25)
  at java.lang.reflect.Method.invoke(Method.java:597)
  at hudson.model.Executor$1.call(Executor.java:429)
  at hudson.util.InterceptingProxy$1.invoke(InterceptingProxy.java:23)
  at $Proxy28.execute(Unknown Source)
  at hudson.maven.MavenBuildProxy$Filter$AsyncInvoker.call(MavenBuildProxy.java:263)
  ... 9 more
ERROR: Asynchronous execution failure
java.util.concurrent.ExecutionException: java.io.IOException: Disk quota exceeded
  at hudson.remoting.Channel$2.adapt(Channel.java:662)
  at hudson.remoting.Channel$2.adapt(Channel.java:657)
  at hudson.remoting.FutureAdapter.get(FutureAdapter.java:55)
  at hudson.maven.MavenBuilder.call(MavenBuilder.java:175)
  at hudson.maven.MavenModuleSetBuild$Builder.call(MavenModuleSetBuild.java:868)
  at hudson.maven.MavenModuleSetBuild$Builder.call(MavenModuleSetBuild.java:799)
  at hudson.remoting.UserRequest.perform(UserRequest.java:114)
  at hudson.remoting.UserRequest.perform(UserRequest.java:48)
  at hudson.remoting.Request$2.run(Request.java:270)
  at java.util.concurrent.Executors$RunnableAdapter.call(Executors.java:441)
  at java.util.concurrent.FutureTask$Sync.innerRun(FutureTask.java:303)
  at java.util.concurrent.FutureTask.run(FutureTask.java:138)
  at java.util.concurrent.ThreadPoolExecutor$Worker.runTask(ThreadPoolExecutor.java:886)
  at java.util.concurrent.ThreadPoolExecutor$Worker.run(ThreadPoolExecutor.java:908)
  at java.lang.Thread.run(Thread.java:662)
Caused by: java.io.IOException: Disk quota exceeded
  at java.io.FileOutputStream.close0(Native Method)
  at java.io.FileOutputStream.close(FileOutputStream.java:279)
  at sun.nio.cs.StreamEncoder.implClose(StreamEncoder.java:301)
  at sun.nio.cs.StreamEncoder.close(StreamEncoder.java:130)
  at java.io.OutputStreamWriter.close(OutputStreamWriter.java:216)
  at java.io.BufferedWriter.close(BufferedWriter.java:248)
  at hudson.util.AtomicFileWriter.close(AtomicFileWriter.java:94)
  at hudson.util.AtomicFileWriter.commit(AtomicFileWriter.java:109)
  at hudson.XmlFile.write(XmlFile.java:166)
  at hudson.model.Fingerprint.save(Fingerprint.java:704)
  at hudson.model.Fingerprint.add(Fingerprint.java:666)
  at hudson.model.Fingerprint.add(Fingerprint.java:651)
  at hudson.maven.reporters.MavenFingerprinter$1.call(MavenFingerprinter.java:107)
  at hudson.maven.reporters.MavenFingerprinter$1.call(MavenFingerprinter.java:96)
  at hudson.maven.MavenBuild$ProxyImpl.execute(MavenBuild.java:379)
  at hudson.maven.MavenBuild$ProxyImpl2.execute(MavenBuild.java:452)
  at sun.reflect.GeneratedMethodAccessor61.invoke(Unknown Source)
  at sun.reflect.DelegatingMethodAccessorImpl.invoke(DelegatingMethodAccessorImpl.java:25)
  at java.lang.reflect.Method.invoke(Method.java:597)
  at hudson.model.Executor$1.call(Executor.java:429)
  at hudson.util.InterceptingProxy$1.invoke(InterceptingProxy.java:23)
  at $Proxy28.execute(Unknown Source)
  at hudson.maven.MavenBuildProxy$Filter$AsyncInvoker.call(MavenBuildProxy.java:263)
  ... 9 more
Sending e-mails to: dhis2-devs@lists.launchpad.net
Sending e-mails to: dhis2-devs@lists.launchpad.net
channel stopped
Archiving artifacts
Performing Post build task...
Could not match :DHIS Web Portal ....................................... SUCCESS : False
Logical operation result is FALSE
Skipping script : echo "Building webapp succeeded. Deploying to dev"
/ifi/utgard/p01/dhis/bin/redeploy-dhis-snapshot
END OF POST BUILD TASK : 0
Failed to send e-mail to Jo St?rset because no e-mail address is known, and no default e-mail domain is configured
Failed to send e-mail to Jan Henrik Overland because no e-mail address is known, and no default e-mail domain is configured

See <http://dhis.uio.no/ci/job/Dhis2%20Web%20Trunk/2070/changes>

Changes:

[Jan Henrik Overland] View history improvements.

···

------------------------------------------
[...truncated 948 lines...]
[INFO] Building jar: <http://dhis.uio.no/ci/job/Dhis2%20Web%20Trunk/ws/dhis-2/dhis-web/dhis-web-mapping/target/dhis-web-mapping/WEB-INF/lib/dhis-web-mapping.jar>
[INFO] Expanding: <http://dhis.uio.no/ci/job/Dhis2%20Web%20Trunk/ws/dhis-2/dhis-web/dhis-web-commons-resources/target/dhis-web-commons-resources-2.1-SNAPSHOT.war> into <http://dhis.uio.no/ci/job/Dhis2%20Web%20Trunk/ws/dhis-2/dhis-web/dhis-web-mapping/target/war/work/dhis-web-commons-resources-2.1-SNAPSHOT>
[INFO] Overlaying 1 war(s).
[INFO] Generating war <http://dhis.uio.no/ci/job/Dhis2%20Web%20Trunk/ws/dhis-2/dhis-web/dhis-web-mapping/target/dhis-web-mapping.war>
[INFO] Building war: <http://dhis.uio.no/ci/job/Dhis2%20Web%20Trunk/ws/dhis-2/dhis-web/dhis-web-mapping/target/dhis-web-mapping.war>
[INFO] [install:install {execution: default-install}]
[INFO] Installing <http://dhis.uio.no/ci/job/Dhis2%20Web%20Trunk/ws/dhis-2/dhis-web/dhis-web-mapping/target/dhis-web-mapping.war> to /ifi/utgard/p01/dhis/.m2/repository/org/hisp/dhis/dhis-web-mapping/2.1-SNAPSHOT/dhis-web-mapping-2.1-SNAPSHOT.war
[INFO] Preparing findbugs:findbugs
[HUDSON] Archiving <http://dhis.uio.no/ci/job/Dhis2%20Web%20Trunk/ws/dhis-2/dhis-web/dhis-web-mapping/pom.xml> to /ifi/utgard/p01/dhis/projects/dhis-dev.ifi.uio.no/ci/home/jobs/Dhis2 Web Trunk/modules/org.hisp.dhis$dhis-web-mapping/builds/2011-02-26_13-47-46/archive/org.hisp.dhis/dhis-web-mapping/2.1-SNAPSHOT/pom.xml
[HUDSON] Archiving <http://dhis.uio.no/ci/job/Dhis2%20Web%20Trunk/ws/dhis-2/dhis-web/dhis-web-mapping/target/dhis-web-mapping.war> to /ifi/utgard/p01/dhis/projects/dhis-dev.ifi.uio.no/ci/home/jobs/Dhis2 Web Trunk/modules/org.hisp.dhis$dhis-web-mapping/builds/2011-02-26_13-47-46/archive/org.hisp.dhis/dhis-web-mapping/2.1-SNAPSHOT/dhis-web-mapping.war
[INFO] [resources:resources {execution: default-resources}]
[INFO] Using encoding: 'UTF-8' to copy filtered resources.
[INFO] [compiler:compile {execution: default-compile}]
[INFO] Nothing to compile - all classes are up to date
[INFO] [findbugs:findbugs {execution: default-cli}]
[INFO] Using source root:
[INFO] <http://dhis.uio.no/ci/job/Dhis2%20Web%20Trunk/ws/dhis-2/dhis-web/dhis-web-mapping/target/classes>
[INFO] Using test source root:
[INFO] <http://dhis.uio.no/ci/job/Dhis2%20Web%20Trunk/ws/dhis-2/dhis-web/dhis-web-mapping/target/test-classes>
[INFO] No effort provided, using default effort.
[INFO] Adding Source Directory: <http://dhis.uio.no/ci/job/Dhis2%20Web%20Trunk/ws/dhis-2/dhis-web/dhis-web-mapping/src/main/java>
[INFO] No threshold provided, using default threshold.
[INFO] Using FindBugs Version: 1.3.8
[INFO] No threshold provided, using default threshold.
[INFO] No threshold provided, using default threshold.
[INFO] No threshold provided, using default threshold.
[INFO] Using the xdoc format
[INFO] No effort provided, using default effort.
[INFO] No threshold provided, using default threshold.
[INFO] No threshold provided, using default threshold.
[INFO] Debugging is Off
[INFO] No bug include filter.
[INFO] Using bug exclude filter /tmp/plexus-resources1255774880tmp
[INFO] Printing Errors
[INFO] Printing Missing classes
[INFO] Printing Source Roots
[FINDBUGS] Successfully parsed file <http://dhis.uio.no/ci/job/Dhis2%20Web%20Trunk/ws/dhis-2/dhis-web/dhis-web-mapping/target/findbugsXml.xml> of module DHIS Mapping with 12 warnings.
[INFO] ------------------------------------------------------------------------
[INFO] Building DHIS Web Dashboard Integration module
[INFO] task-segment: [clean, install, findbugs:findbugs]
[INFO] ------------------------------------------------------------------------
[INFO] [clean:clean {execution: default-clean}]
[INFO] Deleting directory <http://dhis.uio.no/ci/job/Dhis2%20Web%20Trunk/ws/dhis-2/dhis-web/dhis-web-dashboard-integration/target>
[INFO] [resources:resources {execution: default-resources}]
[INFO] Using encoding: 'UTF-8' to copy filtered resources.
[INFO] [compiler:compile {execution: default-compile}]
[INFO] Compiling 20 source files to <http://dhis.uio.no/ci/job/Dhis2%20Web%20Trunk/ws/dhis-2/dhis-web/dhis-web-dashboard-integration/target/classes>
[INFO] [resources:testResources {execution: default-testResources}]
[INFO] Using encoding: 'UTF-8' to copy filtered resources.
[INFO] [compiler:testCompile {execution: default-testCompile}]
[INFO] No sources to compile
[INFO] [surefire:test {execution: default-test}]
[INFO] No tests to run.
[HUDSON] Recording test results
[INFO] [war:war {execution: default-war}]
[INFO] Exploding webapp...
[INFO] Assembling webapp dhis-web-dashboard-integration in <http://dhis.uio.no/ci/job/Dhis2%20Web%20Trunk/ws/dhis-2/dhis-web/dhis-web-dashboard-integration/target/dhis-web-dashboard-integration>
[INFO] Copy webapp webResources to <http://dhis.uio.no/ci/job/Dhis2%20Web%20Trunk/ws/dhis-2/dhis-web/dhis-web-dashboard-integration/target/dhis-web-dashboard-integration>
[INFO] Building jar: <http://dhis.uio.no/ci/job/Dhis2%20Web%20Trunk/ws/dhis-2/dhis-web/dhis-web-dashboard-integration/target/dhis-web-dashboard-integration/WEB-INF/lib/dhis-web-dashboard-integration.jar>
[INFO] Expanding: <http://dhis.uio.no/ci/job/Dhis2%20Web%20Trunk/ws/dhis-2/dhis-web/dhis-web-commons-resources/target/dhis-web-commons-resources-2.1-SNAPSHOT.war> into <http://dhis.uio.no/ci/job/Dhis2%20Web%20Trunk/ws/dhis-2/dhis-web/dhis-web-dashboard-integration/target/war/work/dhis-web-commons-resources-2.1-SNAPSHOT>
[INFO] Overlaying 1 war(s).
[INFO] Generating war <http://dhis.uio.no/ci/job/Dhis2%20Web%20Trunk/ws/dhis-2/dhis-web/dhis-web-dashboard-integration/target/dhis-web-dashboard-integration.war>
[INFO] Building war: <http://dhis.uio.no/ci/job/Dhis2%20Web%20Trunk/ws/dhis-2/dhis-web/dhis-web-dashboard-integration/target/dhis-web-dashboard-integration.war>
[INFO] [install:install {execution: default-install}]
[INFO] Installing <http://dhis.uio.no/ci/job/Dhis2%20Web%20Trunk/ws/dhis-2/dhis-web/dhis-web-dashboard-integration/target/dhis-web-dashboard-integration.war> to /ifi/utgard/p01/dhis/.m2/repository/org/hisp/dhis/dhis-web-dashboard-integration/2.1-SNAPSHOT/dhis-web-dashboard-integration-2.1-SNAPSHOT.war
[INFO] Preparing findbugs:findbugs
[HUDSON] Archiving <http://dhis.uio.no/ci/job/Dhis2%20Web%20Trunk/ws/dhis-2/dhis-web/dhis-web-dashboard-integration/pom.xml> to /ifi/utgard/p01/dhis/projects/dhis-dev.ifi.uio.no/ci/home/jobs/Dhis2 Web Trunk/modules/org.hisp.dhis$dhis-web-dashboard-integration/builds/2011-02-26_13-47-46/archive/org.hisp.dhis/dhis-web-dashboard-integration/2.1-SNAPSHOT/pom.xml
[HUDSON] Archiving <http://dhis.uio.no/ci/job/Dhis2%20Web%20Trunk/ws/dhis-2/dhis-web/dhis-web-dashboard-integration/target/dhis-web-dashboard-integration.war> to /ifi/utgard/p01/dhis/projects/dhis-dev.ifi.uio.no/ci/home/jobs/Dhis2 Web Trunk/modules/org.hisp.dhis$dhis-web-dashboard-integration/builds/2011-02-26_13-47-46/archive/org.hisp.dhis/dhis-web-dashboard-integration/2.1-SNAPSHOT/dhis-web-dashboard-integration.war
[INFO] [resources:resources {execution: default-resources}]
[INFO] Using encoding: 'UTF-8' to copy filtered resources.
[INFO] [compiler:compile {execution: default-compile}]
[INFO] Nothing to compile - all classes are up to date
[INFO] [findbugs:findbugs {execution: default-cli}]
[INFO] Using source root:
[INFO] <http://dhis.uio.no/ci/job/Dhis2%20Web%20Trunk/ws/dhis-2/dhis-web/dhis-web-dashboard-integration/target/classes>
[INFO] Using test source root:
[INFO] <http://dhis.uio.no/ci/job/Dhis2%20Web%20Trunk/ws/dhis-2/dhis-web/dhis-web-dashboard-integration/target/test-classes>
[INFO] No effort provided, using default effort.
[INFO] Adding Source Directory: <http://dhis.uio.no/ci/job/Dhis2%20Web%20Trunk/ws/dhis-2/dhis-web/dhis-web-dashboard-integration/src/main/java>
[INFO] No threshold provided, using default threshold.
[INFO] Using FindBugs Version: 1.3.8
[INFO] No threshold provided, using default threshold.
[INFO] No threshold provided, using default threshold.
[INFO] No threshold provided, using default threshold.
[INFO] Using the xdoc format
[INFO] No effort provided, using default effort.
[INFO] No threshold provided, using default threshold.
[INFO] No threshold provided, using default threshold.
[INFO] Debugging is Off
[INFO] No bug include filter.
[INFO] Using bug exclude filter /tmp/plexus-resources1259865189tmp
[INFO] Printing Errors
[INFO] Printing Missing classes
[INFO] Printing Source Roots
[FINDBUGS] Skipping file DHIS Web Dashboard Integration module of module <http://dhis.uio.no/ci/job/Dhis2%20Web%20Trunk/ws/dhis-2/dhis-web/dhis-web-dashboard-integration/target/findbugsXml.xml> because it's empty.
[HUDSON] Re-archiving <http://dhis.uio.no/ci/job/Dhis2%20Web%20Trunk/ws/dhis-2/dhis-web/dhis-web-dashboard-integration/target/dhis-web-dashboard-integration.war>
[INFO] ------------------------------------------------------------------------
[INFO] Building DHIS Case Entry
[INFO] task-segment: [clean, install, findbugs:findbugs]
[INFO] ------------------------------------------------------------------------
[INFO] [clean:clean {execution: default-clean}]
[INFO] Deleting directory <http://dhis.uio.no/ci/job/Dhis2%20Web%20Trunk/ws/dhis-2/dhis-web/dhis-web-caseentry/target>
[INFO] [resources:resources {execution: default-resources}]
[INFO] Using encoding: 'UTF-8' to copy filtered resources.
[INFO] [compiler:compile {execution: default-compile}]
[INFO] Compiling 36 source files to <http://dhis.uio.no/ci/job/Dhis2%20Web%20Trunk/ws/dhis-2/dhis-web/dhis-web-caseentry/target/classes>
[INFO] [resources:testResources {execution: default-testResources}]
[INFO] Using encoding: 'UTF-8' to copy filtered resources.
[INFO] [compiler:testCompile {execution: default-testCompile}]
[INFO] No sources to compile
[INFO] [surefire:test {execution: default-test}]
[INFO] No tests to run.
[HUDSON] Recording test results
[INFO] [war:war {execution: default-war}]
[INFO] Exploding webapp...
[INFO] Assembling webapp dhis-web-caseentry in <http://dhis.uio.no/ci/job/Dhis2%20Web%20Trunk/ws/dhis-2/dhis-web/dhis-web-caseentry/target/dhis-web-caseentry>
[INFO] Copy webapp webResources to <http://dhis.uio.no/ci/job/Dhis2%20Web%20Trunk/ws/dhis-2/dhis-web/dhis-web-caseentry/target/dhis-web-caseentry>
[INFO] Building jar: <http://dhis.uio.no/ci/job/Dhis2%20Web%20Trunk/ws/dhis-2/dhis-web/dhis-web-caseentry/target/dhis-web-caseentry/WEB-INF/lib/dhis-web-caseentry.jar>
[INFO] Expanding: <http://dhis.uio.no/ci/job/Dhis2%20Web%20Trunk/ws/dhis-2/dhis-web/dhis-web-commons-resources/target/dhis-web-commons-resources-2.1-SNAPSHOT.war> into <http://dhis.uio.no/ci/job/Dhis2%20Web%20Trunk/ws/dhis-2/dhis-web/dhis-web-caseentry/target/war/work/dhis-web-commons-resources-2.1-SNAPSHOT>
[INFO] Overlaying 1 war(s).
[INFO] Generating war <http://dhis.uio.no/ci/job/Dhis2%20Web%20Trunk/ws/dhis-2/dhis-web/dhis-web-caseentry/target/dhis-web-caseentry.war>
[INFO] Building war: <http://dhis.uio.no/ci/job/Dhis2%20Web%20Trunk/ws/dhis-2/dhis-web/dhis-web-caseentry/target/dhis-web-caseentry.war>
[HUDSON] Archiving <http://dhis.uio.no/ci/job/Dhis2%20Web%20Trunk/ws/dhis-2/dhis-web/dhis-web-caseentry/pom.xml> to /ifi/utgard/p01/dhis/projects/dhis-dev.ifi.uio.no/ci/home/jobs/Dhis2 Web Trunk/modules/org.hisp.dhis$dhis-web-caseentry/builds/2011-02-26_13-47-46/archive/org.hisp.dhis/dhis-web-caseentry/2.1-SNAPSHOT/pom.xml
[INFO] ------------------------------------------------------------------------
[ERROR] BUILD ERROR
[INFO] ------------------------------------------------------------------------
[INFO] Error assembling WAR: Problem creating war: Disk quota exceeded

[INFO] ------------------------------------------------------------------------
[INFO] For more information, run Maven with the -e switch
[INFO] ------------------------------------------------------------------------
[INFO] Total time: 14 minutes 14 seconds
[INFO] Finished at: Sat Feb 26 14:02:07 CET 2011
[INFO] Final Memory: 195M/466M
[INFO] ------------------------------------------------------------------------
ERROR: Asynchronous execution failure
java.util.concurrent.ExecutionException: java.io.IOException: Disk quota exceeded
  at hudson.remoting.Channel$2.adapt(Channel.java:662)
  at hudson.remoting.Channel$2.adapt(Channel.java:657)
  at hudson.remoting.FutureAdapter.get(FutureAdapter.java:55)
  at hudson.maven.MavenBuilder.call(MavenBuilder.java:175)
  at hudson.maven.MavenModuleSetBuild$Builder.call(MavenModuleSetBuild.java:868)
  at hudson.maven.MavenModuleSetBuild$Builder.call(MavenModuleSetBuild.java:799)
  at hudson.remoting.UserRequest.perform(UserRequest.java:114)
  at hudson.remoting.UserRequest.perform(UserRequest.java:48)
  at hudson.remoting.Request$2.run(Request.java:270)
  at java.util.concurrent.Executors$RunnableAdapter.call(Executors.java:441)
  at java.util.concurrent.FutureTask$Sync.innerRun(FutureTask.java:303)
  at java.util.concurrent.FutureTask.run(FutureTask.java:138)
  at java.util.concurrent.ThreadPoolExecutor$Worker.runTask(ThreadPoolExecutor.java:886)
  at java.util.concurrent.ThreadPoolExecutor$Worker.run(ThreadPoolExecutor.java:908)
  at java.lang.Thread.run(Thread.java:662)
Caused by: java.io.IOException: Disk quota exceeded
  at java.io.FileOutputStream.close0(Native Method)
  at java.io.FileOutputStream.close(FileOutputStream.java:279)
  at sun.nio.cs.StreamEncoder.implClose(StreamEncoder.java:301)
  at sun.nio.cs.StreamEncoder.close(StreamEncoder.java:130)
  at java.io.OutputStreamWriter.close(OutputStreamWriter.java:216)
  at java.io.BufferedWriter.close(BufferedWriter.java:248)
  at hudson.util.AtomicFileWriter.close(AtomicFileWriter.java:94)
  at hudson.util.AtomicFileWriter.commit(AtomicFileWriter.java:109)
  at hudson.XmlFile.write(XmlFile.java:166)
  at hudson.model.Fingerprint.save(Fingerprint.java:704)
  at hudson.model.Fingerprint.add(Fingerprint.java:666)
  at hudson.model.Fingerprint.add(Fingerprint.java:651)
  at hudson.maven.reporters.MavenFingerprinter$1.call(MavenFingerprinter.java:107)
  at hudson.maven.reporters.MavenFingerprinter$1.call(MavenFingerprinter.java:96)
  at hudson.maven.MavenBuild$ProxyImpl.execute(MavenBuild.java:379)
  at hudson.maven.MavenBuild$ProxyImpl2.execute(MavenBuild.java:452)
  at sun.reflect.GeneratedMethodAccessor61.invoke(Unknown Source)
  at sun.reflect.DelegatingMethodAccessorImpl.invoke(DelegatingMethodAccessorImpl.java:25)
  at java.lang.reflect.Method.invoke(Method.java:597)
  at hudson.model.Executor$1.call(Executor.java:429)
  at hudson.util.InterceptingProxy$1.invoke(InterceptingProxy.java:23)
  at $Proxy28.execute(Unknown Source)
  at hudson.maven.MavenBuildProxy$Filter$AsyncInvoker.call(MavenBuildProxy.java:263)
  ... 9 more
ERROR: Asynchronous execution failure
java.util.concurrent.ExecutionException: java.io.IOException: Disk quota exceeded
  at hudson.remoting.Channel$2.adapt(Channel.java:662)
  at hudson.remoting.Channel$2.adapt(Channel.java:657)
  at hudson.remoting.FutureAdapter.get(FutureAdapter.java:55)
  at hudson.maven.MavenBuilder.call(MavenBuilder.java:175)
  at hudson.maven.MavenModuleSetBuild$Builder.call(MavenModuleSetBuild.java:868)
  at hudson.maven.MavenModuleSetBuild$Builder.call(MavenModuleSetBuild.java:799)
  at hudson.remoting.UserRequest.perform(UserRequest.java:114)
  at hudson.remoting.UserRequest.perform(UserRequest.java:48)
  at hudson.remoting.Request$2.run(Request.java:270)
  at java.util.concurrent.Executors$RunnableAdapter.call(Executors.java:441)
  at java.util.concurrent.FutureTask$Sync.innerRun(FutureTask.java:303)
  at java.util.concurrent.FutureTask.run(FutureTask.java:138)
  at java.util.concurrent.ThreadPoolExecutor$Worker.runTask(ThreadPoolExecutor.java:886)
  at java.util.concurrent.ThreadPoolExecutor$Worker.run(ThreadPoolExecutor.java:908)
  at java.lang.Thread.run(Thread.java:662)
Caused by: java.io.IOException: Disk quota exceeded
  at java.io.FileOutputStream.close0(Native Method)
  at java.io.FileOutputStream.close(FileOutputStream.java:279)
  at sun.nio.cs.StreamEncoder.implClose(StreamEncoder.java:301)
  at sun.nio.cs.StreamEncoder.close(StreamEncoder.java:130)
  at java.io.OutputStreamWriter.close(OutputStreamWriter.java:216)
  at java.io.BufferedWriter.close(BufferedWriter.java:248)
  at hudson.util.AtomicFileWriter.close(AtomicFileWriter.java:94)
  at hudson.util.AtomicFileWriter.commit(AtomicFileWriter.java:109)
  at hudson.XmlFile.write(XmlFile.java:166)
  at hudson.model.Fingerprint.save(Fingerprint.java:704)
  at hudson.model.Fingerprint.add(Fingerprint.java:666)
  at hudson.model.Fingerprint.add(Fingerprint.java:651)
  at hudson.maven.reporters.MavenFingerprinter$1.call(MavenFingerprinter.java:107)
  at hudson.maven.reporters.MavenFingerprinter$1.call(MavenFingerprinter.java:96)
  at hudson.maven.MavenBuild$ProxyImpl.execute(MavenBuild.java:379)
  at hudson.maven.MavenBuild$ProxyImpl2.execute(MavenBuild.java:452)
  at sun.reflect.GeneratedMethodAccessor61.invoke(Unknown Source)
  at sun.reflect.DelegatingMethodAccessorImpl.invoke(DelegatingMethodAccessorImpl.java:25)
  at java.lang.reflect.Method.invoke(Method.java:597)
  at hudson.model.Executor$1.call(Executor.java:429)
  at hudson.util.InterceptingProxy$1.invoke(InterceptingProxy.java:23)
  at $Proxy28.execute(Unknown Source)
  at hudson.maven.MavenBuildProxy$Filter$AsyncInvoker.call(MavenBuildProxy.java:263)
  ... 9 more
Sending e-mails to: dhis2-devs@lists.launchpad.net
channel stopped
Archiving artifacts
Performing Post build task...
Could not match :DHIS Web Portal ....................................... SUCCESS : False
Logical operation result is FALSE
Skipping script : echo "Building webapp succeeded. Deploying to dev"
/ifi/utgard/p01/dhis/bin/redeploy-dhis-snapshot
END OF POST BUILD TASK : 0
FATAL: Disk quota exceeded
java.io.IOException: Disk quota exceeded
  at java.io.FileOutputStream.close0(Native Method)
  at java.io.FileOutputStream.close(FileOutputStream.java:279)
  at sun.nio.cs.StreamEncoder.implClose(StreamEncoder.java:301)
  at sun.nio.cs.StreamEncoder.close(StreamEncoder.java:130)
  at java.io.OutputStreamWriter.close(OutputStreamWriter.java:216)
  at java.io.BufferedWriter.close(BufferedWriter.java:248)
  at hudson.util.AtomicFileWriter.close(AtomicFileWriter.java:94)
  at hudson.util.AtomicFileWriter.commit(AtomicFileWriter.java:109)
  at hudson.XmlFile.write(XmlFile.java:166)
  at hudson.model.Fingerprint.save(Fingerprint.java:704)
  at hudson.model.Fingerprint.add(Fingerprint.java:666)
  at hudson.model.Fingerprint.add(Fingerprint.java:651)
  at hudson.maven.reporters.MavenFingerprinter.aggregate(MavenFingerprinter.java:177)
  at hudson.maven.MavenModuleSetBuild$RunnerImpl.post2(MavenModuleSetBuild.java:773)
  at hudson.model.AbstractBuild$AbstractRunner.post(AbstractBuild.java:548)
  at hudson.model.Run.run(Run.java:1386)
  at hudson.maven.MavenModuleSetBuild.run(MavenModuleSetBuild.java:405)
  at hudson.model.ResourceController.execute(ResourceController.java:88)
  at hudson.model.Executor.run(Executor.java:145)

See <http://dhis.uio.no/ci/job/Dhis2%20Web%20Trunk/2071/changes>