Build failed in Jenkins: Dhis2 Service Trunk » DHIS I18n Static #2756

See <http://dhis.uio.no/ci/job/Dhis2%20Service%20Trunk/org.hisp.dhis$dhis-service-i18n/2756/>

···

------------------------------------------
[INFO] ------------------------------------------------------------------------
[INFO] Building DHIS I18n Static
[INFO] task-segment: [clean, install, findbugs:findbugs]
[INFO] ------------------------------------------------------------------------
[INFO] [clean:clean {execution: default-clean}]
[INFO] Deleting directory <http://dhis.uio.no/ci/job/Dhis2%20Service%20Trunk/org.hisp.dhis$dhis-service-i18n/ws/target>
[INFO] [resources:resources {execution: default-resources}]
[INFO] Using encoding: 'UTF-8' to copy filtered resources.
[INFO] [compiler:compile {execution: default-compile}]
[INFO] Compiling 9 source files to <http://dhis.uio.no/ci/job/Dhis2%20Service%20Trunk/org.hisp.dhis$dhis-service-i18n/ws/target/classes>
[INFO] -------------------------------------------------------------
[ERROR] COMPILATION ERROR :
[INFO] -------------------------------------------------------------
[ERROR] error: error reading /projects/hisp/jenkins_home/jobs/Dhis2 Service Trunk/workspace/dhis-2/dhis-support/dhis-support-external/target/dhis-support-external-2.3-SNAPSHOT.jar; error in opening zip file
[INFO] 1 error
[INFO] -------------------------------------------------------------
[JENKINS] Archiving <http://dhis.uio.no/ci/job/Dhis2%20Service%20Trunk/org.hisp.dhis$dhis-service-i18n/ws/pom.xml> to /projects/hisp/jenkins_home/jobs/Dhis2 Service Trunk/modules/org.hisp.dhis$dhis-service-i18n/builds/2011-05-28_21-01-36/archive/org.hisp.dhis/dhis-service-i18n/2.3-SNAPSHOT/dhis-service-i18n-2.3-SNAPSHOT.pom
[INFO] ------------------------------------------------------------------------
[ERROR] BUILD FAILURE
[INFO] ------------------------------------------------------------------------
[INFO] Compilation failure
error: error reading /projects/hisp/jenkins_home/jobs/Dhis2 Service Trunk/workspace/dhis-2/dhis-support/dhis-support-external/target/dhis-support-external-2.3-SNAPSHOT.jar; error in opening zip file

[INFO] ------------------------------------------------------------------------
[INFO] For more information, run Maven with the -e switch
[INFO] ------------------------------------------------------------------------
[INFO] Total time: 3 minutes
[INFO] Finished at: Sat May 28 21:04:43 CEST 2011
[INFO] Final Memory: 125M/729M
[INFO] ------------------------------------------------------------------------