Build failed in Jenkins: Dhis2 Service Trunk » DHIS Administration Service #2369

See <http://dhis.uio.no/ci/job/Dhis2%20Service%20Trunk/org.hisp.dhis$dhis-service-administration/2369/>

···

------------------------------------------
[INFO] ------------------------------------------------------------------------
[INFO] Building DHIS Administration Service
[INFO] task-segment: [clean, install, findbugs:findbugs]
[INFO] ------------------------------------------------------------------------
[INFO] [clean:clean {execution: default-clean}]
[INFO] Deleting directory <http://dhis.uio.no/ci/job/Dhis2%20Service%20Trunk/org.hisp.dhis$dhis-service-administration/ws/target>
[INFO] [resources:resources {execution: default-resources}]
[INFO] Using encoding: 'UTF-8' to copy filtered resources.
[INFO] [compiler:compile {execution: default-compile}]
[INFO] Compiling 28 source files to <http://dhis.uio.no/ci/job/Dhis2%20Service%20Trunk/org.hisp.dhis$dhis-service-administration/ws/target/classes>
[INFO] [resources:testResources {execution: default-testResources}]
[INFO] Using encoding: 'UTF-8' to copy filtered resources.
[INFO] [compiler:testCompile {execution: default-testCompile}]
[INFO] Compiling 14 source files to <http://dhis.uio.no/ci/job/Dhis2%20Service%20Trunk/org.hisp.dhis$dhis-service-administration/ws/target/test-classes>
[INFO] [surefire:test {execution: default-test}]
[INFO] Surefire report directory: <http://dhis.uio.no/ci/job/Dhis2%20Service%20Trunk/org.hisp.dhis$dhis-service-administration/ws/target/surefire-reports>

-------------------------------------------------------
T E S T S
-------------------------------------------------------
Running org.hisp.dhis.sqlview.SqlViewServiceTest
Tests run: 8, Failures: 0, Errors: 0, Skipped: 0, Time elapsed: 50.904 sec
Running org.hisp.dhis.dataarchive.DataArchiveServiceTest
Tests run: 2, Failures: 0, Errors: 0, Skipped: 1, Time elapsed: 3.078 sec
Running org.hisp.dhis.dataintegrity.DataIntegrityServiceTest
Tests run: 12, Failures: 0, Errors: 0, Skipped: 0, Time elapsed: 7.337 sec
Running org.hisp.dhis.maintenance.MaintenanceStoreTest
Tests run: 1, Failures: 0, Errors: 0, Skipped: 0, Time elapsed: 0.46 sec
Running org.hisp.dhis.datalock.DataSetLockServiceTest
Tests run: 10, Failures: 0, Errors: 0, Skipped: 0, Time elapsed: 1.939 sec
Running org.hisp.dhis.statistics.StatisticsProviderTest
Tests run: 2, Failures: 0, Errors: 0, Skipped: 0, Time elapsed: 0.462 sec
Running org.hisp.dhis.databrowser.DataBrowserServiceTest
Tests run: 8, Failures: 0, Errors: 0, Skipped: 0, Time elapsed: 4.869 sec
Running org.hisp.dhis.useraudit.UserAuditStoreTest
Tests run: 2, Failures: 0, Errors: 0, Skipped: 0, Time elapsed: 0.159 sec
Running org.hisp.dhis.databrowser.DataBrowserStoreTest
Tests run: 11, Failures: 0, Errors: 0, Skipped: 0, Time elapsed: 4.684 sec
Running org.hisp.dhis.resourcetable.ResourceTableServiceTest
Tests run: 1, Failures: 0, Errors: 0, Skipped: 0, Time elapsed: 0.078 sec

Results :

Tests run: 57, Failures: 0, Errors: 0, Skipped: 1

[HUDSON] Recording test results
FATAL: Failed to save the JUnit test result
java.io.IOException: Disk quota exceeded
  at java.io.FileOutputStream.close0(Native Method)
  at java.io.FileOutputStream.close(FileOutputStream.java:279)
  at sun.nio.cs.StreamEncoder.implClose(StreamEncoder.java:301)
  at sun.nio.cs.StreamEncoder.close(StreamEncoder.java:130)
  at java.io.OutputStreamWriter.close(OutputStreamWriter.java:216)
  at java.io.BufferedWriter.close(BufferedWriter.java:248)
  at hudson.util.AtomicFileWriter.close(AtomicFileWriter.java:94)
  at hudson.util.AtomicFileWriter.commit(AtomicFileWriter.java:109)
  at hudson.XmlFile.write(XmlFile.java:166)
  at hudson.tasks.junit.TestResultAction.setResult(TestResultAction.java:82)
  at hudson.tasks.junit.TestResultAction.<init>(TestResultAction.java:67)
  at hudson.maven.reporters.SurefireReport.<init>(SurefireReport.java:45)
  at hudson.maven.reporters.SurefireArchiver$1.call(SurefireArchiver.java:132)
  at hudson.maven.reporters.SurefireArchiver$1.call(SurefireArchiver.java:128)
  at hudson.maven.MavenBuild$ProxyImpl.execute(MavenBuild.java:379)
  at hudson.maven.MavenBuild$ProxyImpl2.execute(MavenBuild.java:452)
  at sun.reflect.GeneratedMethodAccessor167.invoke(Unknown Source)
  at sun.reflect.DelegatingMethodAccessorImpl.invoke(DelegatingMethodAccessorImpl.java:25)
  at java.lang.reflect.Method.invoke(Method.java:597)
  at hudson.model.Executor$1.call(Executor.java:429)
  at hudson.util.InterceptingProxy$1.invoke(InterceptingProxy.java:23)
  at $Proxy30.execute(Unknown Source)
  at sun.reflect.GeneratedMethodAccessor171.invoke(Unknown Source)
  at sun.reflect.DelegatingMethodAccessorImpl.invoke(DelegatingMethodAccessorImpl.java:25)
  at java.lang.reflect.Method.invoke(Method.java:597)
  at hudson.remoting.RemoteInvocationHandler$RPCRequest.perform(RemoteInvocationHandler.java:274)
  at hudson.remoting.RemoteInvocationHandler$RPCRequest.call(RemoteInvocationHandler.java:255)
  at hudson.remoting.RemoteInvocationHandler$RPCRequest.call(RemoteInvocationHandler.java:215)
  at hudson.remoting.UserRequest.perform(UserRequest.java:114)
  at hudson.remoting.UserRequest.perform(UserRequest.java:48)
  at hudson.remoting.Request$2.run(Request.java:270)
  at java.util.concurrent.Executors$RunnableAdapter.call(Executors.java:441)
  at java.util.concurrent.FutureTask$Sync.innerRun(FutureTask.java:303)
  at java.util.concurrent.FutureTask.run(FutureTask.java:138)
  at java.util.concurrent.ThreadPoolExecutor$Worker.runTask(ThreadPoolExecutor.java:886)
  at java.util.concurrent.ThreadPoolExecutor$Worker.run(ThreadPoolExecutor.java:908)
  at java.lang.Thread.run(Thread.java:662)
[INFO] [jar:jar {execution: default-jar}]
[HUDSON] Archiving <http://dhis.uio.no/ci/job/Dhis2%20Service%20Trunk/org.hisp.dhis$dhis-service-administration/ws/pom.xml> to /ifi/utgard/p01/dhis/projects/dhis-dev.ifi.uio.no/ci/home/jobs/Dhis2 Service Trunk/modules/org.hisp.dhis$dhis-service-administration/builds/2011-03-29_12-30-58/archive/org.hisp.dhis/dhis-service-administration/2.2-SNAPSHOT/pom.xml
[INFO] ------------------------------------------------------------------------
[ERROR] BUILD ERROR
[INFO] ------------------------------------------------------------------------
[INFO] Error assembling JAR

Embedded error: Disk quota exceeded
[INFO] ------------------------------------------------------------------------
[INFO] For more information, run Maven with the -e switch
[INFO] ------------------------------------------------------------------------
[INFO] Total time: 11 minutes 9 seconds
[INFO] Finished at: Tue Mar 29 12:42:18 CEST 2011
[INFO] Final Memory: 148M/353M
[INFO] ------------------------------------------------------------------------
ERROR: Asynchronous execution failure
java.util.concurrent.ExecutionException: java.io.IOException: Disk quota exceeded
  at hudson.remoting.Channel$2.adapt(Channel.java:662)
  at hudson.remoting.Channel$2.adapt(Channel.java:657)
  at hudson.remoting.FutureAdapter.get(FutureAdapter.java:55)
  at hudson.maven.MavenBuilder.call(MavenBuilder.java:175)
  at hudson.maven.MavenModuleSetBuild$Builder.call(MavenModuleSetBuild.java:868)
  at hudson.maven.MavenModuleSetBuild$Builder.call(MavenModuleSetBuild.java:799)
  at hudson.remoting.UserRequest.perform(UserRequest.java:114)
  at hudson.remoting.UserRequest.perform(UserRequest.java:48)
  at hudson.remoting.Request$2.run(Request.java:270)
  at java.util.concurrent.Executors$RunnableAdapter.call(Executors.java:441)
  at java.util.concurrent.FutureTask$Sync.innerRun(FutureTask.java:303)
  at java.util.concurrent.FutureTask.run(FutureTask.java:138)
  at java.util.concurrent.ThreadPoolExecutor$Worker.runTask(ThreadPoolExecutor.java:886)
  at java.util.concurrent.ThreadPoolExecutor$Worker.run(ThreadPoolExecutor.java:908)
  at java.lang.Thread.run(Thread.java:662)
Caused by: java.io.IOException: Disk quota exceeded
  at java.io.FileOutputStream.close0(Native Method)
  at java.io.FileOutputStream.close(FileOutputStream.java:279)
  at sun.nio.cs.StreamEncoder.implClose(StreamEncoder.java:301)
  at sun.nio.cs.StreamEncoder.close(StreamEncoder.java:130)
  at java.io.OutputStreamWriter.close(OutputStreamWriter.java:216)
  at java.io.BufferedWriter.close(BufferedWriter.java:248)
  at hudson.util.AtomicFileWriter.close(AtomicFileWriter.java:94)
  at hudson.util.AtomicFileWriter.commit(AtomicFileWriter.java:109)
  at hudson.XmlFile.write(XmlFile.java:166)
  at hudson.model.Fingerprint.save(Fingerprint.java:704)
  at hudson.model.Fingerprint.add(Fingerprint.java:666)
  at hudson.model.Fingerprint.add(Fingerprint.java:651)
  at hudson.maven.reporters.MavenFingerprinter$1.call(MavenFingerprinter.java:105)
  at hudson.maven.reporters.MavenFingerprinter$1.call(MavenFingerprinter.java:96)
  at hudson.maven.MavenBuild$ProxyImpl.execute(MavenBuild.java:379)
  at hudson.maven.MavenBuild$ProxyImpl2.execute(MavenBuild.java:452)
  at sun.reflect.GeneratedMethodAccessor167.invoke(Unknown Source)
  at sun.reflect.DelegatingMethodAccessorImpl.invoke(DelegatingMethodAccessorImpl.java:25)
  at java.lang.reflect.Method.invoke(Method.java:597)
  at hudson.model.Executor$1.call(Executor.java:429)
  at hudson.util.InterceptingProxy$1.invoke(InterceptingProxy.java:23)
  at $Proxy30.execute(Unknown Source)
  at hudson.maven.MavenBuildProxy$Filter$AsyncInvoker.call(MavenBuildProxy.java:263)
  ... 9 more

See <http://dhis.uio.no/ci/job/Dhis2%20Service%20Trunk/org.hisp.dhis$dhis-service-administration/2370/>