Build failed in Jenkins: dhis-service-2.1 #172

See <http://dhis.uio.no/ci/job/dhis-service-2.1/172/changes>

Changes:

[Lars Helge Overland] R 3004

···

------------------------------------------
[...truncated 253 lines...]
[INFO] No threshold provided, using default threshold.
[INFO] No threshold provided, using default threshold.
[INFO] Using the xdoc format
[INFO] No effort provided, using default effort.
[INFO] No threshold provided, using default threshold.
[INFO] No threshold provided, using default threshold.
[INFO] Debugging is Off
[INFO] No bug include filter.
[INFO] Using bug exclude filter /tmp/plexus-resources1185047411tmp
[FINDBUGS] Successfully parsed file <http://dhis.uio.no/ci/job/dhis-service-2.1/ws/dhis-2/dhis-support/dhis-support-test/target/findbugsXml.xml> of module DHIS Test Support with 2 warnings.
[HUDSON] Recording test results
[HUDSON] Archiving <http://dhis.uio.no/ci/job/dhis-service-2.1/ws/dhis-2/dhis-support/dhis-support-external/pom.xml> to /ifi/utgard/p01/dhis/projects/dhis-dev.ifi.uio.no/ci/home/jobs/dhis-service-2.1/modules/org.hisp.dhis$dhis-support-external/builds/2011-03-11_12-31-04/archive/org.hisp.dhis/dhis-support-external/2.1/pom.xml
[HUDSON] Archiving <http://dhis.uio.no/ci/job/dhis-service-2.1/ws/dhis-2/dhis-support/dhis-support-external/target/dhis-support-external-2.1.jar> to /ifi/utgard/p01/dhis/projects/dhis-dev.ifi.uio.no/ci/home/jobs/dhis-service-2.1/modules/org.hisp.dhis$dhis-support-external/builds/2011-03-11_12-31-04/archive/org.hisp.dhis/dhis-support-external/2.1/dhis-support-external-2.1.jar
[INFO] Printing Errors
[INFO] Printing Missing classes
[INFO] Printing Source Roots
[INFO] ------------------------------------------------------------------------
[INFO] Building DHIS External Support
[INFO] task-segment: [clean, install, findbugs:findbugs]
[INFO] ------------------------------------------------------------------------
[INFO] [clean:clean {execution: default-clean}]
[INFO] Deleting directory <http://dhis.uio.no/ci/job/dhis-service-2.1/ws/dhis-2/dhis-support/dhis-support-external/target>
[INFO] [resources:resources {execution: default-resources}]
[INFO] Using encoding: 'UTF-8' to copy filtered resources.
[INFO] [compiler:compile {execution: default-compile}]
[INFO] Compiling 3 source files to <http://dhis.uio.no/ci/job/dhis-service-2.1/ws/dhis-2/dhis-support/dhis-support-external/target/classes>
[INFO] [resources:testResources {execution: default-testResources}]
[INFO] Using encoding: 'UTF-8' to copy filtered resources.
[INFO] [compiler:testCompile {execution: default-testCompile}]
[INFO] No sources to compile
[INFO] [surefire:test {execution: default-test}]
[INFO] No tests to run.
[INFO] [jar:jar {execution: default-jar}]
[INFO] Building jar: <http://dhis.uio.no/ci/job/dhis-service-2.1/ws/dhis-2/dhis-support/dhis-support-external/target/dhis-support-external-2.1.jar>
[INFO] [install:install {execution: default-install}]
[INFO] Installing <http://dhis.uio.no/ci/job/dhis-service-2.1/ws/dhis-2/dhis-support/dhis-support-external/target/dhis-support-external-2.1.jar> to /ifi/utgard/p01/dhis/.m2/repository/org/hisp/dhis/dhis-support-external/2.1/dhis-support-external-2.1.jar
[INFO] Preparing findbugs:findbugs
[INFO] [resources:resources {execution: default-resources}]
[INFO] Using encoding: 'UTF-8' to copy filtered resources.
[INFO] [compiler:compile {execution: default-compile}]
[INFO] Nothing to compile - all classes are up to date
[INFO] [findbugs:findbugs {execution: default-cli}]
[INFO] Using source root:
[INFO] <http://dhis.uio.no/ci/job/dhis-service-2.1/ws/dhis-2/dhis-support/dhis-support-external/target/classes>
[INFO] Using test source root:
[INFO] <http://dhis.uio.no/ci/job/dhis-service-2.1/ws/dhis-2/dhis-support/dhis-support-external/target/test-classes>
[INFO] No effort provided, using default effort.
[INFO] Adding Source Directory: <http://dhis.uio.no/ci/job/dhis-service-2.1/ws/dhis-2/dhis-support/dhis-support-external/src/main/java>
[INFO] No threshold provided, using default threshold.
[INFO] Using FindBugs Version: 1.3.8
[INFO] No threshold provided, using default threshold.
[INFO] No threshold provided, using default threshold.
[INFO] No threshold provided, using default threshold.
[INFO] Using the xdoc format
[INFO] No effort provided, using default effort.
[INFO] No threshold provided, using default threshold.
[INFO] No threshold provided, using default threshold.
[INFO] Debugging is Off
[INFO] No bug include filter.
[INFO] Using bug exclude filter /tmp/plexus-resources241240793tmp
[FINDBUGS] Successfully parsed file <http://dhis.uio.no/ci/job/dhis-service-2.1/ws/dhis-2/dhis-support/dhis-support-external/target/findbugsXml.xml> of module DHIS External Support with 2 warnings.
[INFO] Printing Errors
[INFO] Printing Missing classes
[INFO] Printing Source Roots
[INFO] ------------------------------------------------------------------------
[INFO] Building DHIS Hibernate Support
[INFO] task-segment: [clean, install, findbugs:findbugs]
[INFO] ------------------------------------------------------------------------
[INFO] [clean:clean {execution: default-clean}]
[INFO] Deleting directory <http://dhis.uio.no/ci/job/dhis-service-2.1/ws/dhis-2/dhis-support/dhis-support-hibernate/target>
[INFO] [resources:resources {execution: default-resources}]
[INFO] Using encoding: 'UTF-8' to copy filtered resources.
[INFO] [compiler:compile {execution: default-compile}]
[INFO] Compiling 12 source files to <http://dhis.uio.no/ci/job/dhis-service-2.1/ws/dhis-2/dhis-support/dhis-support-hibernate/target/classes>
[INFO] [resources:testResources {execution: default-testResources}]
[INFO] Using encoding: 'UTF-8' to copy filtered resources.
[INFO] [compiler:testCompile {execution: default-testCompile}]
[INFO] Nothing to compile - all classes are up to date
[INFO] [surefire:test {execution: default-test}]
[INFO] Surefire report directory: <http://dhis.uio.no/ci/job/dhis-service-2.1/ws/dhis-2/dhis-support/dhis-support-hibernate/target/surefire-reports>

-------------------------------------------------------
T E S T S
-------------------------------------------------------
There are no tests to run.

Results :

Tests run: 0, Failures: 0, Errors: 0, Skipped: 0

[HUDSON] Recording test results
[INFO] [jar:jar {execution: default-jar}]
[INFO] Building jar: <http://dhis.uio.no/ci/job/dhis-service-2.1/ws/dhis-2/dhis-support/dhis-support-hibernate/target/dhis-support-hibernate-2.1.jar>
[INFO] [install:install {execution: default-install}]
[INFO] Installing <http://dhis.uio.no/ci/job/dhis-service-2.1/ws/dhis-2/dhis-support/dhis-support-hibernate/target/dhis-support-hibernate-2.1.jar> to /ifi/utgard/p01/dhis/.m2/repository/org/hisp/dhis/dhis-support-hibernate/2.1/dhis-support-hibernate-2.1.jar
[INFO] Preparing findbugs:findbugs
[HUDSON] Archiving <http://dhis.uio.no/ci/job/dhis-service-2.1/ws/dhis-2/dhis-support/dhis-support-hibernate/pom.xml> to /ifi/utgard/p01/dhis/projects/dhis-dev.ifi.uio.no/ci/home/jobs/dhis-service-2.1/modules/org.hisp.dhis$dhis-support-hibernate/builds/2011-03-11_12-31-04/archive/org.hisp.dhis/dhis-support-hibernate/2.1/pom.xml
[HUDSON] Archiving <http://dhis.uio.no/ci/job/dhis-service-2.1/ws/dhis-2/dhis-support/dhis-support-hibernate/target/dhis-support-hibernate-2.1.jar> to /ifi/utgard/p01/dhis/projects/dhis-dev.ifi.uio.no/ci/home/jobs/dhis-service-2.1/modules/org.hisp.dhis$dhis-support-hibernate/builds/2011-03-11_12-31-04/archive/org.hisp.dhis/dhis-support-hibernate/2.1/dhis-support-hibernate-2.1.jar
[INFO] [resources:resources {execution: default-resources}]
[INFO] Using encoding: 'UTF-8' to copy filtered resources.
[INFO] [compiler:compile {execution: default-compile}]
[INFO] Nothing to compile - all classes are up to date
[INFO] [findbugs:findbugs {execution: default-cli}]
[INFO] Using source root:
[INFO] <http://dhis.uio.no/ci/job/dhis-service-2.1/ws/dhis-2/dhis-support/dhis-support-hibernate/target/classes>
[INFO] Using test source root:
[INFO] <http://dhis.uio.no/ci/job/dhis-service-2.1/ws/dhis-2/dhis-support/dhis-support-hibernate/target/test-classes>
[INFO] No effort provided, using default effort.
[INFO] Adding Source Directory: <http://dhis.uio.no/ci/job/dhis-service-2.1/ws/dhis-2/dhis-support/dhis-support-hibernate/src/main/java>
[INFO] No threshold provided, using default threshold.
[INFO] Using FindBugs Version: 1.3.8
[INFO] No threshold provided, using default threshold.
[INFO] No threshold provided, using default threshold.
[INFO] No threshold provided, using default threshold.
[INFO] Using the xdoc format
[INFO] No effort provided, using default effort.
[INFO] No threshold provided, using default threshold.
[INFO] No threshold provided, using default threshold.
[INFO] Debugging is Off
[INFO] No bug include filter.
[INFO] Using bug exclude filter /tmp/plexus-resources1575975922tmp
[FINDBUGS] Successfully parsed file <http://dhis.uio.no/ci/job/dhis-service-2.1/ws/dhis-2/dhis-support/dhis-support-hibernate/target/findbugsXml.xml> of module DHIS Hibernate Support with 0 warnings.
[INFO] Printing Errors
[INFO] Printing Missing classes
[INFO] Printing Source Roots
[INFO] ------------------------------------------------------------------------
[INFO] Building DHIS System Support
[INFO] task-segment: [clean, install, findbugs:findbugs]
[INFO] ------------------------------------------------------------------------
[INFO] [clean:clean {execution: default-clean}]
[INFO] Deleting directory <http://dhis.uio.no/ci/job/dhis-service-2.1/ws/dhis-2/dhis-support/dhis-support-system/target>
[INFO] [resources:resources {execution: default-resources}]
[INFO] Using encoding: 'UTF-8' to copy filtered resources.
[INFO] [compiler:compile {execution: default-compile}]
[INFO] Compiling 73 source files to <http://dhis.uio.no/ci/job/dhis-service-2.1/ws/dhis-2/dhis-support/dhis-support-system/target/classes>
[INFO] [resources:testResources {execution: default-testResources}]
[INFO] Using encoding: 'UTF-8' to copy filtered resources.
[INFO] [compiler:testCompile {execution: default-testCompile}]
[INFO] Compiling 15 source files to <http://dhis.uio.no/ci/job/dhis-service-2.1/ws/dhis-2/dhis-support/dhis-support-system/target/test-classes>
[INFO] [surefire:test {execution: default-test}]
[INFO] Surefire report directory: <http://dhis.uio.no/ci/job/dhis-service-2.1/ws/dhis-2/dhis-support/dhis-support-system/target/surefire-reports>

-------------------------------------------------------
T E S T S
-------------------------------------------------------
Running org.hisp.dhis.system.util.ConversionUtilsTest
Tests run: 1, Failures: 0, Errors: 0, Skipped: 0, Time elapsed: 0.131 sec
Running org.hisp.dhis.system.util.CodecUtilsTest
Tests run: 3, Failures: 0, Errors: 0, Skipped: 0, Time elapsed: 0.039 sec
Running org.hisp.dhis.system.util.MathUtilsTest
Tests run: 5, Failures: 0, Errors: 0, Skipped: 0, Time elapsed: 0.271 sec
Running org.hisp.dhis.system.util.ReflectionUtilsTest
Tests run: 6, Failures: 0, Errors: 0, Skipped: 0, Time elapsed: 0.025 sec
Running org.hisp.dhis.system.database.DatabaseInfoProviderTest
Tests run: 1, Failures: 0, Errors: 0, Skipped: 0, Time elapsed: 6.087 sec
Running org.hisp.dhis.system.util.TimeUtilsTest
Tests run: 2, Failures: 0, Errors: 0, Skipped: 0, Time elapsed: 0.648 sec
Running org.hisp.dhis.system.grid.GridTest
Tests run: 21, Failures: 0, Errors: 0, Skipped: 0, Time elapsed: 0.075 sec
Running org.hisp.dhis.system.util.TextUtilsTest
Tests run: 1, Failures: 0, Errors: 0, Skipped: 0, Time elapsed: 0.01 sec
Running org.hisp.dhis.system.util.DebugUtilsTest
* WARN 12:35:43,591 Duplicate found: 'tom' for key: 'name' (DebugUtils.java [main])
* WARN 12:35:43,594 Duplicate found: 'john' for key: 'name' (DebugUtils.java [main])
* WARN 12:35:43,594 Duplicate found: 'A2-A3' for key: 'code' (DebugUtils.java [main])
* WARN 12:35:43,595 Duplicate found: 'A2-A3' for key: 'code' (DebugUtils.java [main])
* WARN 12:35:43,595 Duplicate found: '1-2-3' for key: 'identifier' (DebugUtils.java [main])
Tests run: 1, Failures: 0, Errors: 0, Skipped: 0, Time elapsed: 0.054 sec
Running org.hisp.dhis.system.util.DateUtilsTest
Tests run: 2, Failures: 0, Errors: 0, Skipped: 0, Time elapsed: 0.049 sec
Running org.hisp.dhis.system.util.PaginatedListTest
Tests run: 4, Failures: 0, Errors: 0, Skipped: 0, Time elapsed: 0.011 sec
Running org.hisp.dhis.system.filter.AggregatableDataElementFilterTest
Tests run: 1, Failures: 0, Errors: 0, Skipped: 0, Time elapsed: 0.033 sec
Running org.hisp.dhis.system.util.StreamUtilsTest
Tests run: 2, Failures: 0, Errors: 0, Skipped: 0, Time elapsed: 0.016 sec

Results :

Tests run: 50, Failures: 0, Errors: 0, Skipped: 0

[HUDSON] Recording test results
[INFO] [jar:jar {execution: default-jar}]
[INFO] Building jar: <http://dhis.uio.no/ci/job/dhis-service-2.1/ws/dhis-2/dhis-support/dhis-support-system/target/dhis-support-system-2.1.jar>
[INFO] [install:install {execution: default-install}]
[INFO] Installing <http://dhis.uio.no/ci/job/dhis-service-2.1/ws/dhis-2/dhis-support/dhis-support-system/target/dhis-support-system-2.1.jar> to /ifi/utgard/p01/dhis/.m2/repository/org/hisp/dhis/dhis-support-system/2.1/dhis-support-system-2.1.jar
[INFO] Preparing findbugs:findbugs
[HUDSON] Archiving <http://dhis.uio.no/ci/job/dhis-service-2.1/ws/dhis-2/dhis-support/dhis-support-system/pom.xml> to /ifi/utgard/p01/dhis/projects/dhis-dev.ifi.uio.no/ci/home/jobs/dhis-service-2.1/modules/org.hisp.dhis$dhis-support-system/builds/2011-03-11_12-31-04/archive/org.hisp.dhis/dhis-support-system/2.1/pom.xml
[HUDSON] Archiving <http://dhis.uio.no/ci/job/dhis-service-2.1/ws/dhis-2/dhis-support/dhis-support-system/target/dhis-support-system-2.1.jar> to /ifi/utgard/p01/dhis/projects/dhis-dev.ifi.uio.no/ci/home/jobs/dhis-service-2.1/modules/org.hisp.dhis$dhis-support-system/builds/2011-03-11_12-31-04/archive/org.hisp.dhis/dhis-support-system/2.1/dhis-support-system-2.1.jar
[INFO] [resources:resources {execution: default-resources}]
[INFO] Using encoding: 'UTF-8' to copy filtered resources.
[INFO] [compiler:compile {execution: default-compile}]
[INFO] Nothing to compile - all classes are up to date
                                                                                                                                                                                                                                                                                                                                                                                                                                                                                                                                                                                                                                                                                                                                                                                                                                                                                                                                                                                                                                                                                                                                                                                                                                                                                                                                                                                                                                                                                                                                                                                                                                                                                                                                                                                                                                                                                                                                                                                                                                                                                                                                                                                                                                                                                                                                                                                                                                                                                                                                                                                                                                                                                                                                                                                                                                                                                                                                                                                                                                                                                                                                                                                                                                                                                                                                                                                                                                                                                                                                                                         java.util.concurrent.ExecutionException: java.io.IOException: Disk quota exceeded
  at hudson.remoting.Channel$2.adapt(Channel.java:662)
  at hudson.remoting.Channel$2.adapt(Channel.java:657)
  at hudson.remoting.FutureAdapter.get(FutureAdapter.java:55)
  at hudson.maven.MavenBuilder.call(MavenBuilder.java:175)
  at hudson.maven.MavenModuleSetBuild$Builder.call(MavenModuleSetBuild.java:868)
  at hudson.maven.MavenModuleSetBuild$Builder.call(MavenModuleSetBuild.java:799)
  at hudson.remoting.UserRequest.perform(UserRequest.java:114)
  at hudson.remoting.UserRequest.perform(UserRequest.java:48)
  at hudson.remoting.Request$2.run(Request.java:270)
  at java.util.concurrent.Executors$RunnableAdapter.call(Executors.java:441)
  at java.util.concurrent.FutureTask$Sync.innerRun(FutureTask.java:303)
  at java.util.concurrent.FutureTask.run(FutureTask.java:138)
  at java.util.concurrent.ThreadPoolExecutor$Worker.runTask(ThreadPoolExecutor.java:886)
  at java.util.concurrent.ThreadPoolExecutor$Worker.run(ThreadPoolExecutor.java:908)
  at java.lang.Thread.run(Thread.java:662)
Caused by: java.io.IOException: Disk quota exceeded
  at java.io.FileOutputStream.close0(Native Method)
  at java.io.FileOutputStream.close(FileOutputStream.java:279)
  at sun.nio.cs.StreamEncoder.implClose(StreamEncoder.java:301)
  at sun.nio.cs.StreamEncoder.close(StreamEncoder.java:130)
  at java.io.OutputStreamWriter.close(OutputStreamWriter.java:216)
  at java.io.BufferedWriter.close(BufferedWriter.java:248)
  at hudson.util.AtomicFileWriter.close(AtomicFileWriter.java:94)
  at hudson.util.AtomicFileWriter.commit(AtomicFileWriter.java:109)
  at hudson.XmlFile.write(XmlFile.java:166)
  at hudson.model.Fingerprint.save(Fingerprint.java:704)
  at hudson.model.Fingerprint.add(Fingerprint.java:666)
  at hudson.model.Fingerprint.add(Fingerprint.java:651)
  at hudson.maven.reporters.MavenFingerprinter$1.call(MavenFingerprinter.java:105)
  at hudson.maven.reporters.MavenFingerprinter$1.call(MavenFingerprinter.java:96)
  at hudson.maven.MavenBuild$ProxyImpl.execute(MavenBuild.java:379)
  at hudson.maven.MavenBuild$ProxyImpl2.execute(MavenBuild.java:452)
  at sun.reflect.GeneratedMethodAccessor167.invoke(Unknown Source)
  at sun.reflect.DelegatingMethodAccessorImpl.invoke(DelegatingMethodAccessorImpl.java:25)
  at java.lang.reflect.Method.invoke(Method.java:597)
  at hudson.model.Executor$1.call(Executor.java:429)
  at hudson.util.InterceptingProxy$1.invoke(InterceptingProxy.java:23)
  at $Proxy30.execute(Unknown Source)
  at hudson.maven.MavenBuildProxy$Filter$AsyncInvoker.call(MavenBuildProxy.java:263)
  ... 9 more
[ERROR] BUILD FAILURE
[INFO] ------------------------------------------------------------------------
[INFO] Compilation failure
<http://dhis.uio.no/ci/job/dhis-service-2.1/ws/dhis-2/dhis-support/dhis-support-jdbc/src/main/java/org/hisp/dhis/jdbc/batchhandler/DataSetBatchHandler.java>:[38,7] error while writing org.hisp.dhis.jdbc.batchhandler.DataSetBatchHandler: Disk quota exceeded

[INFO] ------------------------------------------------------------------------
[INFO] For more information, run Maven with the -e switch
[INFO] ------------------------------------------------------------------------
[INFO] Total time: 5 minutes 5 seconds
[INFO] Finished at: Fri Mar 11 12:36:23 CET 2011
[INFO] Final Memory: 94M/278M
[INFO] ------------------------------------------------------------------------
Sending e-mails to: dhis2-devs@lists.launchpad.net
channel stopped

See <http://dhis.uio.no/ci/job/dhis-service-2.1/173/changes>