Build failed in Hudson: Dhis2 Web Trunk #1920

See <http://dhis.uio.no/ci/job/Dhis2%20Web%20Trunk/1920/changes>

Changes:

[Lars Helge Overland] Fixed bug 'Data set delete confirmation message'

[Lars Helge Overland] Fixed bug, should only allow data elements of same period type in validation rule expression. Not completely waterproof but alot better.

[Lars Helge Overland] Added pagination to operand list in validation rule editor

···

------------------------------------------
Started by upstream project "Dhis2 Service Trunk" build number 1992
$ bzr revision-info -d "<http://dhis.uio.no/ci/job/Dhis2%20Web%20Trunk/ws/">
[workspace] $ bzr pull --overwrite https://code.launchpad.net/~dhis2-devs-core/dhis2/trunk
M dhis-2/dhis-web/dhis-web-commons-resources/src/main/webapp/dhis-web-commons/javascripts/commons.ajax.js
M dhis-2/dhis-web/dhis-web-commons/src/main/java/org/hisp/dhis/commons/action/GetOperandsAction.java
M dhis-2/dhis-web/dhis-web-commons/src/main/java/org/hisp/dhis/paging/ActionPagingSupport.java
M dhis-2/dhis-web/dhis-web-maintenance/dhis-web-maintenance-datadictionary/src/main/webapp/dhis-web-maintenance-datadictionary/indicatorExpressionBuilderForm.vm
M dhis-2/dhis-web/dhis-web-maintenance/dhis-web-maintenance-dataset/src/main/webapp/dhis-web-maintenance-dataset/sectionList.vm
M dhis-2/dhis-web/dhis-web-validationrule/src/main/webapp/dhis-web-validationrule/addValidationRuleForm.vm
M dhis-2/dhis-web/dhis-web-validationrule/src/main/webapp/dhis-web-validationrule/expressionBuilderForm.vm
All changes applied successfully.
Now on revision 2721.
$ bzr revision-info -d "<http://dhis.uio.no/ci/job/Dhis2%20Web%20Trunk/ws/">
[workspace] $ bzr log -v -r revid:larshelge@gmail.com-20110122210838-klpsr3d3mz0qk0o3..revid:larshelge@gmail.com-20110122224108-2oqtykyn0i63r2ah --long --show-ids
Getting local revision...
$ bzr revision-info -d "<http://dhis.uio.no/ci/job/Dhis2%20Web%20Trunk/ws/">
larshelge@gmail.com-20110122224108-2oqtykyn0i63r2ah
Deleting old artifacts from #1918
Parsing POMs
[dhis-web] $ /local/opt/j2sdk/bin/java -Xmx1024m -XX:MaxPermSize=512m -cp /ifi/utgard/p01/dhis/projects/dhis-dev.ifi.uio.no/ci/home/plugins/maven-plugin/WEB-INF/lib/maven-agent-1.389.jar:/ifi/utgard/p01/dhis/projects/dhis-dev.ifi.uio.no/ci/home/tools/2.2.1/boot/classworlds-1.1.jar hudson.maven.agent.Main /ifi/utgard/p01/dhis/projects/dhis-dev.ifi.uio.no/ci/home/tools/2.2.1 /ifi/utgard/p01/dhis/projects/dhis-dev.ifi.uio.no/ci/tomcat/webapps/ci/WEB-INF/lib/remoting-1.389.jar /ifi/utgard/p01/dhis/projects/dhis-dev.ifi.uio.no/ci/home/plugins/maven-plugin/WEB-INF/lib/maven-interceptor-1.389.jar 42890 /ifi/utgard/p01/dhis/projects/dhis-dev.ifi.uio.no/ci/home/plugins/maven-plugin/WEB-INF/lib/maven2.1-interceptor-1.2.jar
<===[HUDSON REMOTING CAPACITY]===> channel started
Executing Maven: -B -f <http://dhis.uio.no/ci/job/Dhis2%20Web%20Trunk/ws/dhis-2/dhis-web/pom.xml> clean install findbugs:findbugs
[INFO] Scanning for projects...
[INFO] Reactor build order:
[INFO] DHIS Web Modules Project
[INFO] DHIS Common Functionality for Web
[INFO] DHIS Common Resources for Web
[INFO] DHIS Web Modules Maintenance
[INFO] DHIS Data Set Management
[INFO] DHIS Data Dictionary
[INFO] DHIS Organisation Unit Management
[INFO] DHIS Setting Maintenance
[INFO] DHIS User Maintenance
[INFO] DHIS Data Administration
[INFO] DHIS Patient Management
[INFO] DHIS Data Entry
[INFO] DHIS Import-Export
[INFO] DHIS Data Mart
[INFO] DHIS Validation Rule
[INFO] DHIS Web Reporting
[INFO] DHIS Mapping
[INFO] DHIS Web Dashboard Integration module
[INFO] DHIS Case Entry
[INFO] DHIS Web API
[INFO] DHIS Web Portal
[INFO] ------------------------------------------------------------------------
[INFO] Building DHIS Web Modules Project
[INFO] task-segment: [clean, install, findbugs:findbugs]
[INFO] ------------------------------------------------------------------------
[INFO] [clean:clean {execution: default-clean}]
[INFO] [site:attach-descriptor {execution: default-attach-descriptor}]
[INFO] [install:install {execution: default-install}]
[INFO] Installing <http://dhis.uio.no/ci/job/Dhis2%20Web%20Trunk/ws/dhis-2/dhis-web/pom.xml> to /ifi/utgard/p01/dhis/.m2/repository/org/hisp/dhis/dhis-web/2.0.6-SNAPSHOT/dhis-web-2.0.6-SNAPSHOT.pom
[INFO] Preparing findbugs:findbugs
[INFO] No goals needed for project - skipping
[INFO] Setting property: classpath.resource.loader.class => 'org.codehaus.plexus.velocity.ContextClassLoaderResourceLoader'.
[INFO] Setting property: velocimacro.messages.on => 'false'.
[INFO] Setting property: resource.loader => 'classpath'.
[INFO] Setting property: resource.manager.logwhenfound => 'false'.
[INFO] **************************************************************
[INFO] Starting Jakarta Velocity v1.4
[INFO] RuntimeInstance initializing.
[INFO] Default Properties File: org/apache/velocity/runtime/defaults/velocity.properties
[INFO] Default ResourceManager initializing. (class org.apache.velocity.runtime.resource.ResourceManagerImpl)
[INFO] Resource Loader Instantiated: org.codehaus.plexus.velocity.ContextClassLoaderResourceLoader
[INFO] ClasspathResourceLoader : initialization starting.
[INFO] ClasspathResourceLoader : initialization complete.
[INFO] ResourceCache : initialized. (class org.apache.velocity.runtime.resource.ResourceCacheImpl)
[INFO] Default ResourceManager initialization complete.
[INFO] Loaded System Directive: org.apache.velocity.runtime.directive.Literal
[INFO] Loaded System Directive: org.apache.velocity.runtime.directive.Macro
[INFO] Loaded System Directive: org.apache.velocity.runtime.directive.Parse
[INFO] Loaded System Directive: org.apache.velocity.runtime.directive.Include
[INFO] Loaded System Directive: org.apache.velocity.runtime.directive.Foreach
[INFO] Created: 20 parsers.
[INFO] Velocimacro : initialization starting.
[INFO] Velocimacro : adding VMs from VM library template : VM_global_library.vm
[ERROR] ResourceManager : unable to find resource 'VM_global_library.vm' in any resource loader.
[INFO] Velocimacro : error using VM library template VM_global_library.vm : org.apache.velocity.exception.ResourceNotFoundException: Unable to find resource 'VM_global_library.vm'
[INFO] Velocimacro : VM library template macro registration complete.
[INFO] Velocimacro : allowInline = true : VMs can be defined inline in templates
[INFO] Velocimacro : allowInlineToOverride = false : VMs defined inline may NOT replace previous VM definitions
[INFO] Velocimacro : allowInlineLocal = false : VMs defined inline will be global in scope if allowed.
[INFO] Velocimacro : initialization complete.
[INFO] Velocity successfully started.
[INFO] [findbugs:findbugs {execution: default-cli}]
[HUDSON] Archiving <http://dhis.uio.no/ci/job/Dhis2%20Web%20Trunk/ws/dhis-2/dhis-web/pom.xml> to /ifi/utgard/p01/dhis/projects/dhis-dev.ifi.uio.no/ci/home/jobs/Dhis2 Web Trunk/modules/org.hisp.dhis$dhis-web/builds/2011-01-22_23-47-23/archive/org.hisp.dhis/dhis-web/2.0.6-SNAPSHOT/pom.xml
[INFO] Using source root:
[INFO] <http://dhis.uio.no/ci/job/Dhis2%20Web%20Trunk/ws/dhis-2/dhis-web/target/classes>
[INFO] Using test source root:
[INFO] <http://dhis.uio.no/ci/job/Dhis2%20Web%20Trunk/ws/dhis-2/dhis-web/target/test-classes>
[INFO] Output class directory doesn't exist. Skipping findbugs.
[HUDSON] Archiving /ifi/utgard/p01/dhis/.m2/repository/org/hisp/dhis/dhis-web/2.0.6-SNAPSHOT/dhis-web-2.0.6-SNAPSHOT.pom to /ifi/utgard/p01/dhis/projects/dhis-dev.ifi.uio.no/ci/home/jobs/Dhis2 Web Trunk/modules/org.hisp.dhis$dhis-web/builds/2011-01-22_23-47-23/archive/org.hisp.dhis/dhis-web/2.0.6-SNAPSHOT/dhis-web-2.0.6-SNAPSHOT.pom
[INFO] ------------------------------------------------------------------------
[INFO] Building DHIS Common Functionality for Web
[INFO] task-segment: [clean, install, findbugs:findbugs]
[INFO] ------------------------------------------------------------------------
[INFO] [clean:clean {execution: default-clean}]
[INFO] Deleting directory <http://dhis.uio.no/ci/job/Dhis2%20Web%20Trunk/ws/dhis-2/dhis-web/dhis-web-commons/target>
[INFO] [antrun:run {execution: default}]
[INFO] Executing tasks
    [mkdir] Created dir: <http://dhis.uio.no/ci/job/Dhis2%20Web%20Trunk/ws/dhis-2/dhis-web/dhis-web-commons/target/classes>
[INFO] Executed tasks
[INFO] [resources:resources {execution: default-resources}]
[INFO] Using encoding: 'UTF-8' to copy filtered resources.
[INFO] [compiler:compile {execution: default-compile}]
[INFO] Compiling 132 source files to <http://dhis.uio.no/ci/job/Dhis2%20Web%20Trunk/ws/dhis-2/dhis-web/dhis-web-commons/target/classes>
[HUDSON] Archiving <http://dhis.uio.no/ci/job/Dhis2%20Web%20Trunk/ws/dhis-2/dhis-web/dhis-web-commons/pom.xml> to /ifi/utgard/p01/dhis/projects/dhis-dev.ifi.uio.no/ci/home/jobs/Dhis2 Web Trunk/modules/org.hisp.dhis$dhis-web-commons/builds/2011-01-22_23-47-23/archive/org.hisp.dhis/dhis-web-commons/2.0.6-SNAPSHOT/pom.xml
Waiting for Hudson to finish collecting data
[INFO] ------------------------------------------------------------------------
[ERROR] BUILD FAILURE
[INFO] ------------------------------------------------------------------------
[INFO] Compilation failure

<http://dhis.uio.no/ci/job/Dhis2%20Web%20Trunk/ws/dhis-2/dhis-web/dhis-web-commons/src/main/java/org/hisp/dhis/commons/action/GetOperandsAction.java>:[43,34] cannot find symbol
symbol : class DataElementPeriodTypeFilter
location: package org.hisp.dhis.system.filter

<http://dhis.uio.no/ci/job/Dhis2%20Web%20Trunk/ws/dhis-2/dhis-web/dhis-web-commons/src/main/java/org/hisp/dhis/commons/action/GetOperandsAction.java>:[173,50] cannot find symbol
symbol : class DataElementPeriodTypeFilter
location: class org.hisp.dhis.commons.action.GetOperandsAction

[INFO] ------------------------------------------------------------------------
[INFO] For more information, run Maven with the -e switch
[INFO] ------------------------------------------------------------------------
[INFO] Total time: 29 seconds
[INFO] Finished at: Sat Jan 22 23:47:57 CET 2011
[INFO] Final Memory: 41M/102M
[INFO] ------------------------------------------------------------------------
Failed to send e-mail to Lars Helge Overland because no e-mail address is known, and no default e-mail domain is configured
Sending e-mails to: dhis2-devs@lists.launchpad.net
channel stopped
Archiving artifacts
Performing Post build task...
Could not match :DHIS Web Portal ....................................... SUCCESS : False
Logical operation result is FALSE
Skipping script : echo "Building webapp succeeded. Deploying to dev"
/ifi/utgard/p01/dhis/bin/redeploy-dhis-snapshot
END OF POST BUILD TASK : 0
Failed to send e-mail to Lars Helge Overland because no e-mail address is known, and no default e-mail domain is configured

See <http://dhis.uio.no/ci/job/Dhis2%20Web%20Trunk/1921/changes>