Build failed in Hudson: Dhis2 Web Trunk #1248

See <http://dhis.uio.no/ci/job/Dhis2%20Web%20Trunk/1248/changes>

Changes:

[Tri Tran Thanh] update select data element function in design data entry form more easier, simple and faster

[Mithilesh Kumar Thakur] Bug Fixed in Data Entry

···

------------------------------------------
[...truncated 14 lines...]
Now on revision 2339.
$ bzr revision-info -d "<http://dhis.uio.no/ci/job/Dhis2%20Web%20Trunk/ws/">
[workspace] $ bzr log -v -r revid:jason-p-pickering-20101008081853-s2hcy1qrlydkcaj4..revid:thanh@compaq-20101008101254-3b5rezqigk670o2o --long --show-ids
Getting local revision...
$ bzr revision-info -d "<http://dhis.uio.no/ci/job/Dhis2%20Web%20Trunk/ws/">
thanh@compaq-20101008101254-3b5rezqigk670o2o
Deleting old artifacts from #1246
Parsing POMs
[dhis-web] $ /local/opt/j2sdk/bin/java -Xmx1024m -XX:MaxPermSize=512m -cp /ifi/utgard/p01/dhis/projects/dhis-dev.ifi.uio.no/ci/home/plugins/maven-plugin/WEB-INF/lib/maven-agent-1.375.jar:/ifi/utgard/p01/dhis/projects/dhis-dev.ifi.uio.no/ci/home/tools/2.2.1/boot/classworlds-1.1.jar hudson.maven.agent.Main /ifi/utgard/p01/dhis/projects/dhis-dev.ifi.uio.no/ci/home/tools/2.2.1 /ifi/utgard/p01/dhis/projects/dhis-dev.ifi.uio.no/ci/tomcat/webapps/ci/WEB-INF/lib/remoting-1.375.jar /ifi/utgard/p01/dhis/projects/dhis-dev.ifi.uio.no/ci/home/plugins/maven-plugin/WEB-INF/lib/maven-interceptor-1.375.jar 37845 /ifi/utgard/p01/dhis/projects/dhis-dev.ifi.uio.no/ci/home/plugins/maven-plugin/WEB-INF/lib/maven2.1-interceptor-1.2.jar
<===[HUDSON REMOTING CAPACITY]===> channel started
Executing Maven: -B -f <http://dhis.uio.no/ci/job/Dhis2%20Web%20Trunk/ws/dhis-2/dhis-web/pom.xml> clean install findbugs:findbugs
[INFO] Scanning for projects...
[INFO] Reactor build order:
[INFO] DHIS Web Modules Project
[INFO] DHIS Common Functionality for Web
[INFO] DHIS Common Resources for Web
[INFO] DHIS Web Modules Maintenance
[INFO] DHIS Data Set Management
[INFO] DHIS Data Dictionary
[INFO] DHIS Organisation Unit Management
[INFO] DHIS Setting Maintenance
[INFO] DHIS User Maintenance
[INFO] DHIS Data Administration
[INFO] DHIS Patient Management
[INFO] DHIS Data Entry
[INFO] DHIS Import-Export
[INFO] DHIS Data Mart
[INFO] DHIS Validation Rule
[INFO] DHIS Web Reporting
[INFO] DHIS Mapping
[INFO] DHIS Web Dashboard Integration module
[INFO] DHIS Web Excel Reporting
[INFO] DHIS Case Entry
[INFO] DHIS Web Portal
[INFO] ------------------------------------------------------------------------
[INFO] Building DHIS Web Modules Project
[INFO] task-segment: [clean, install, findbugs:findbugs]
[INFO] ------------------------------------------------------------------------
[INFO] [clean:clean {execution: default-clean}]
[INFO] [site:attach-descriptor {execution: default-attach-descriptor}]
[INFO] [install:install {execution: default-install}]
[INFO] Installing <http://dhis.uio.no/ci/job/Dhis2%20Web%20Trunk/ws/dhis-2/dhis-web/pom.xml> to /ifi/utgard/p01/dhis/.m2/repository/org/hisp/dhis/dhis-web/2.0.6-SNAPSHOT/dhis-web-2.0.6-SNAPSHOT.pom
[INFO] Preparing findbugs:findbugs
[INFO] No goals needed for project - skipping
[INFO] Setting property: classpath.resource.loader.class => 'org.codehaus.plexus.velocity.ContextClassLoaderResourceLoader'.
[INFO] Setting property: velocimacro.messages.on => 'false'.
[INFO] Setting property: resource.loader => 'classpath'.
[INFO] Setting property: resource.manager.logwhenfound => 'false'.
[INFO] **************************************************************
[INFO] Starting Jakarta Velocity v1.4
[INFO] RuntimeInstance initializing.
[INFO] Default Properties File: org/apache/velocity/runtime/defaults/velocity.properties
[INFO] Default ResourceManager initializing. (class org.apache.velocity.runtime.resource.ResourceManagerImpl)
[INFO] Resource Loader Instantiated: org.codehaus.plexus.velocity.ContextClassLoaderResourceLoader
[INFO] ClasspathResourceLoader : initialization starting.
[INFO] ClasspathResourceLoader : initialization complete.
[INFO] ResourceCache : initialized. (class org.apache.velocity.runtime.resource.ResourceCacheImpl)
[INFO] Default ResourceManager initialization complete.
[INFO] Loaded System Directive: org.apache.velocity.runtime.directive.Literal
[INFO] Loaded System Directive: org.apache.velocity.runtime.directive.Macro
[INFO] Loaded System Directive: org.apache.velocity.runtime.directive.Parse
[INFO] Loaded System Directive: org.apache.velocity.runtime.directive.Include
[INFO] Loaded System Directive: org.apache.velocity.runtime.directive.Foreach
[INFO] Created: 20 parsers.
[INFO] Velocimacro : initialization starting.
[INFO] Velocimacro : adding VMs from VM library template : VM_global_library.vm
[ERROR] ResourceManager : unable to find resource 'VM_global_library.vm' in any resource loader.
[INFO] Velocimacro : error using VM library template VM_global_library.vm : org.apache.velocity.exception.ResourceNotFoundException: Unable to find resource 'VM_global_library.vm'
[INFO] Velocimacro : VM library template macro registration complete.
[INFO] Velocimacro : allowInline = true : VMs can be defined inline in templates
[INFO] Velocimacro : allowInlineToOverride = false : VMs defined inline may NOT replace previous VM definitions
[INFO] Velocimacro : allowInlineLocal = false : VMs defined inline will be global in scope if allowed.
[INFO] Velocimacro : initialization complete.
[INFO] Velocity successfully started.
[INFO] [findbugs:findbugs {execution: default-cli}]
[INFO] Using source root:
[INFO] <http://dhis.uio.no/ci/job/Dhis2%20Web%20Trunk/ws/dhis-2/dhis-web/target/classes>
[INFO] Using test source root:
[INFO] <http://dhis.uio.no/ci/job/Dhis2%20Web%20Trunk/ws/dhis-2/dhis-web/target/test-classes>
[INFO] Output class directory doesn't exist. Skipping findbugs.
[HUDSON] Archiving <http://dhis.uio.no/ci/job/Dhis2%20Web%20Trunk/ws/dhis-2/dhis-web/pom.xml> to /ifi/utgard/p01/dhis/projects/dhis-dev.ifi.uio.no/ci/home/jobs/Dhis2 Web Trunk/modules/org.hisp.dhis$dhis-web/builds/2010-10-08_12-17-46/archive/org.hisp.dhis/dhis-web/2.0.6-SNAPSHOT/pom.xml
[HUDSON] Archiving /ifi/utgard/p01/dhis/.m2/repository/org/hisp/dhis/dhis-web/2.0.6-SNAPSHOT/dhis-web-2.0.6-SNAPSHOT.pom to /ifi/utgard/p01/dhis/projects/dhis-dev.ifi.uio.no/ci/home/jobs/Dhis2 Web Trunk/modules/org.hisp.dhis$dhis-web/builds/2010-10-08_12-17-46/archive/org.hisp.dhis/dhis-web/2.0.6-SNAPSHOT/dhis-web-2.0.6-SNAPSHOT.pom
[INFO] ------------------------------------------------------------------------
[INFO] Building DHIS Common Functionality for Web
[INFO] task-segment: [clean, install, findbugs:findbugs]
[INFO] ------------------------------------------------------------------------
[INFO] [clean:clean {execution: default-clean}]
[INFO] Deleting directory <http://dhis.uio.no/ci/job/Dhis2%20Web%20Trunk/ws/dhis-2/dhis-web/dhis-web-commons/target>
[INFO] [antrun:run {execution: default}]
[INFO] Executing tasks
    [mkdir] Created dir: <http://dhis.uio.no/ci/job/Dhis2%20Web%20Trunk/ws/dhis-2/dhis-web/dhis-web-commons/target/classes>
[INFO] Executed tasks
[INFO] [resources:resources {execution: default-resources}]
[INFO] Using encoding: 'UTF-8' to copy filtered resources.
[INFO] [compiler:compile {execution: default-compile}]
[INFO] Compiling 127 source files to <http://dhis.uio.no/ci/job/Dhis2%20Web%20Trunk/ws/dhis-2/dhis-web/dhis-web-commons/target/classes>
[INFO] [resources:testResources {execution: default-testResources}]
[INFO] Using encoding: 'UTF-8' to copy filtered resources.
[INFO] [compiler:testCompile {execution: default-testCompile}]
[INFO] Compiling 2 source files to <http://dhis.uio.no/ci/job/Dhis2%20Web%20Trunk/ws/dhis-2/dhis-web/dhis-web-commons/target/test-classes>
[INFO] [surefire:test {execution: default-test}]
[INFO] Surefire report directory: <http://dhis.uio.no/ci/job/Dhis2%20Web%20Trunk/ws/dhis-2/dhis-web/dhis-web-commons/target/surefire-reports>

-------------------------------------------------------
T E S T S
-------------------------------------------------------
Running org.hisp.dhis.ouwt.manager.OrganisationUnitSelectionManagerTest
Tests run: 3, Failures: 0, Errors: 0, Skipped: 0, Time elapsed: 28.17 sec

Results :

Tests run: 3, Failures: 0, Errors: 0, Skipped: 0

[HUDSON] Recording test results
[INFO] [jar:jar {execution: default-jar}]
[INFO] Building jar: <http://dhis.uio.no/ci/job/Dhis2%20Web%20Trunk/ws/dhis-2/dhis-web/dhis-web-commons/target/dhis-web-commons-2.0.6-SNAPSHOT.jar>
[INFO] [install:install {execution: default-install}]
[INFO] Installing <http://dhis.uio.no/ci/job/Dhis2%20Web%20Trunk/ws/dhis-2/dhis-web/dhis-web-commons/target/dhis-web-commons-2.0.6-SNAPSHOT.jar> to /ifi/utgard/p01/dhis/.m2/repository/org/hisp/dhis/dhis-web-commons/2.0.6-SNAPSHOT/dhis-web-commons-2.0.6-SNAPSHOT.jar
[INFO] Preparing findbugs:findbugs
[HUDSON] Archiving <http://dhis.uio.no/ci/job/Dhis2%20Web%20Trunk/ws/dhis-2/dhis-web/dhis-web-commons/pom.xml> to /ifi/utgard/p01/dhis/projects/dhis-dev.ifi.uio.no/ci/home/jobs/Dhis2 Web Trunk/modules/org.hisp.dhis$dhis-web-commons/builds/2010-10-08_12-17-46/archive/org.hisp.dhis/dhis-web-commons/2.0.6-SNAPSHOT/pom.xml
[HUDSON] Archiving <http://dhis.uio.no/ci/job/Dhis2%20Web%20Trunk/ws/dhis-2/dhis-web/dhis-web-commons/target/dhis-web-commons-2.0.6-SNAPSHOT.jar> to /ifi/utgard/p01/dhis/projects/dhis-dev.ifi.uio.no/ci/home/jobs/Dhis2 Web Trunk/modules/org.hisp.dhis$dhis-web-commons/builds/2010-10-08_12-17-46/archive/org.hisp.dhis/dhis-web-commons/2.0.6-SNAPSHOT/dhis-web-commons-2.0.6-SNAPSHOT.jar
[INFO] [antrun:run {execution: default}]
[INFO] Executing tasks
[INFO] Executed tasks
[INFO] [resources:resources {execution: default-resources}]
[INFO] Using encoding: 'UTF-8' to copy filtered resources.
[INFO] [compiler:compile {execution: default-compile}]
[INFO] Nothing to compile - all classes are up to date
[INFO] [findbugs:findbugs {execution: default-cli}]
[INFO] Using source root:
[INFO] <http://dhis.uio.no/ci/job/Dhis2%20Web%20Trunk/ws/dhis-2/dhis-web/dhis-web-commons/target/classes>
[INFO] Using test source root:
[INFO] <http://dhis.uio.no/ci/job/Dhis2%20Web%20Trunk/ws/dhis-2/dhis-web/dhis-web-commons/target/test-classes>
[INFO] No effort provided, using default effort.
[INFO] Adding Source Directory: <http://dhis.uio.no/ci/job/Dhis2%20Web%20Trunk/ws/dhis-2/dhis-web/dhis-web-commons/src/main/java>
[INFO] No threshold provided, using default threshold.
[INFO] Using FindBugs Version: 1.3.8
[INFO] No threshold provided, using default threshold.
[INFO] No threshold provided, using default threshold.
[INFO] No threshold provided, using default threshold.
[INFO] Using the xdoc format
[INFO] No effort provided, using default effort.
[INFO] No threshold provided, using default threshold.
[INFO] No threshold provided, using default threshold.
[INFO] Debugging is Off
[INFO] No bug include filter.
[INFO] Using bug exclude filter /tmp/plexus-resources1029381618tmp
[INFO] Printing Errors
[INFO] Printing Missing classes
[INFO] Printing Source Roots
log4j:WARN No appenders could be found for logger (org.apache.commons.digester.Digester.sax).
log4j:WARN Please initialize the log4j system properly.
[FINDBUGS] Successfully parsed file <http://dhis.uio.no/ci/job/Dhis2%20Web%20Trunk/ws/dhis-2/dhis-web/dhis-web-commons/target/findbugsXml.xml> of module DHIS Common Functionality for Web with 32 warnings.
[INFO] ------------------------------------------------------------------------
[INFO] Building DHIS Common Resources for Web
[INFO] task-segment: [clean, install, findbugs:findbugs]
[INFO] ------------------------------------------------------------------------
[INFO] [clean:clean {execution: default-clean}]
[INFO] Deleting directory <http://dhis.uio.no/ci/job/Dhis2%20Web%20Trunk/ws/dhis-2/dhis-web/dhis-web-commons-resources/target>
[INFO] [resources:resources {execution: default-resources}]
[INFO] Using encoding: 'UTF-8' to copy filtered resources.
[INFO] [compiler:compile {execution: default-compile}]
[INFO] No sources to compile
[INFO] [resources:testResources {execution: default-testResources}]
[INFO] Using encoding: 'UTF-8' to copy filtered resources.
[INFO] [compiler:testCompile {execution: default-testCompile}]
[INFO] No sources to compile
[INFO] [surefire:test {execution: default-test}]
[INFO] No tests to run.
[HUDSON] Recording test results
[INFO] [war:war {execution: default-war}]
[INFO] Exploding webapp...
[INFO] Assembling webapp dhis-web-commons-resources in <http://dhis.uio.no/ci/job/Dhis2%20Web%20Trunk/ws/dhis-2/dhis-web/dhis-web-commons-resources/target/dhis-web-commons-resources-2.0.6-SNAPSHOT>
[INFO] Copy webapp webResources to <http://dhis.uio.no/ci/job/Dhis2%20Web%20Trunk/ws/dhis-2/dhis-web/dhis-web-commons-resources/target/dhis-web-commons-resources-2.0.6-SNAPSHOT>
[INFO] Generating war <http://dhis.uio.no/ci/job/Dhis2%20Web%20Trunk/ws/dhis-2/dhis-web/dhis-web-commons-resources/target/dhis-web-commons-resources-2.0.6-SNAPSHOT.war>
[INFO] Building war: <http://dhis.uio.no/ci/job/Dhis2%20Web%20Trunk/ws/dhis-2/dhis-web/dhis-web-commons-resources/target/dhis-web-commons-resources-2.0.6-SNAPSHOT.war>
[INFO] [install:install {execution: default-install}]
[INFO] Installing <http://dhis.uio.no/ci/job/Dhis2%20Web%20Trunk/ws/dhis-2/dhis-web/dhis-web-commons-resources/target/dhis-web-commons-resources-2.0.6-SNAPSHOT.war> to /ifi/utgard/p01/dhis/.m2/repository/org/hisp/dhis/dhis-web-commons-resources/2.0.6-SNAPSHOT/dhis-web-commons-resources-2.0.6-SNAPSHOT.war
[INFO] Preparing findbugs:findbugs
[HUDSON] Archiving <http://dhis.uio.no/ci/job/Dhis2%20Web%20Trunk/ws/dhis-2/dhis-web/dhis-web-commons-resources/pom.xml> to /ifi/utgard/p01/dhis/projects/dhis-dev.ifi.uio.no/ci/home/jobs/Dhis2 Web Trunk/modules/org.hisp.dhis$dhis-web-commons-resources/builds/2010-10-08_12-17-46/archive/org.hisp.dhis/dhis-web-commons-resources/2.0.6-SNAPSHOT/pom.xml
[HUDSON] Archiving <http://dhis.uio.no/ci/job/Dhis2%20Web%20Trunk/ws/dhis-2/dhis-web/dhis-web-commons-resources/target/dhis-web-commons-resources-2.0.6-SNAPSHOT.war> to /ifi/utgard/p01/dhis/projects/dhis-dev.ifi.uio.no/ci/home/jobs/Dhis2 Web Trunk/modules/org.hisp.dhis$dhis-web-commons-resources/builds/2010-10-08_12-17-46/archive/org.hisp.dhis/dhis-web-commons-resources/2.0.6-SNAPSHOT/dhis-web-commons-resources-2.0.6-SNAPSHOT.war
[INFO] [resources:resources {execution: default-resources}]
[INFO] Using encoding: 'UTF-8' to copy filtered resources.
[INFO] [compiler:compile {execution: default-compile}]
[INFO] No sources to compile
[INFO] [findbugs:findbugs {execution: default-cli}]
[INFO] Using source root:
[INFO] <http://dhis.uio.no/ci/job/Dhis2%20Web%20Trunk/ws/dhis-2/dhis-web/dhis-web-commons-resources/target/classes>
[INFO] Using test source root:
[INFO] <http://dhis.uio.no/ci/job/Dhis2%20Web%20Trunk/ws/dhis-2/dhis-web/dhis-web-commons-resources/target/test-classes>
[INFO] Output class directory doesn't exist. Skipping findbugs.
[INFO] ------------------------------------------------------------------------
[INFO] Building DHIS Web Modules Maintenance
[INFO] task-segment: [clean, install, findbugs:findbugs]
[INFO] ------------------------------------------------------------------------
[INFO] [clean:clean {execution: default-clean}]
[INFO] [site:attach-descriptor {execution: default-attach-descriptor}]
[INFO] [install:install {execution: default-install}]
[INFO] Installing <http://dhis.uio.no/ci/job/Dhis2%20Web%20Trunk/ws/dhis-2/dhis-web/dhis-web-maintenance/pom.xml> to /ifi/utgard/p01/dhis/.m2/repository/org/hisp/dhis/dhis-web-maintenance/2.0.6-SNAPSHOT/dhis-web-maintenance-2.0.6-SNAPSHOT.pom
[INFO] Preparing findbugs:findbugs
[INFO] No goals needed for project - skipping
[INFO] [findbugs:findbugs {execution: default-cli}]
[INFO] Using source root:
[INFO] <http://dhis.uio.no/ci/job/Dhis2%20Web%20Trunk/ws/dhis-2/dhis-web/dhis-web-maintenance/target/classes>
[INFO] Using test source root:
[INFO] <http://dhis.uio.no/ci/job/Dhis2%20Web%20Trunk/ws/dhis-2/dhis-web/dhis-web-maintenance/target/test-classes>
[INFO] Output class directory doesn't exist. Skipping findbugs.
[HUDSON] Archiving <http://dhis.uio.no/ci/job/Dhis2%20Web%20Trunk/ws/dhis-2/dhis-web/dhis-web-maintenance/pom.xml> to /ifi/utgard/p01/dhis/projects/dhis-dev.ifi.uio.no/ci/home/jobs/Dhis2 Web Trunk/modules/org.hisp.dhis$dhis-web-maintenance/builds/2010-10-08_12-17-46/archive/org.hisp.dhis/dhis-web-maintenance/2.0.6-SNAPSHOT/pom.xml
[HUDSON] Archiving /ifi/utgard/p01/dhis/.m2/repository/org/hisp/dhis/dhis-web-maintenance/2.0.6-SNAPSHOT/dhis-web-maintenance-2.0.6-SNAPSHOT.pom to /ifi/utgard/p01/dhis/projects/dhis-dev.ifi.uio.no/ci/home/jobs/Dhis2 Web Trunk/modules/org.hisp.dhis$dhis-web-maintenance/builds/2010-10-08_12-17-46/archive/org.hisp.dhis/dhis-web-maintenance/2.0.6-SNAPSHOT/dhis-web-maintenance-2.0.6-SNAPSHOT.pom
[INFO] ------------------------------------------------------------------------
[INFO] Building DHIS Data Set Management
[INFO] task-segment: [clean, install, findbugs:findbugs]
[INFO] ------------------------------------------------------------------------
[INFO] [clean:clean {execution: default-clean}]
[INFO] Deleting directory <http://dhis.uio.no/ci/job/Dhis2%20Web%20Trunk/ws/dhis-2/dhis-web/dhis-web-maintenance/dhis-web-maintenance-dataset/target>
[INFO] [resources:resources {execution: default-resources}]
[INFO] Using encoding: 'UTF-8' to copy filtered resources.
[INFO] [compiler:compile {execution: default-compile}]
[INFO] Compiling 48 source files to <http://dhis.uio.no/ci/job/Dhis2%20Web%20Trunk/ws/dhis-2/dhis-web/dhis-web-maintenance/dhis-web-maintenance-dataset/target/classes>
[HUDSON] Archiving <http://dhis.uio.no/ci/job/Dhis2%20Web%20Trunk/ws/dhis-2/dhis-web/dhis-web-maintenance/dhis-web-maintenance-dataset/pom.xml> to /ifi/utgard/p01/dhis/projects/dhis-dev.ifi.uio.no/ci/home/jobs/Dhis2 Web Trunk/modules/org.hisp.dhis$dhis-web-maintenance-dataset/builds/2010-10-08_12-17-46/archive/org.hisp.dhis/dhis-web-maintenance-dataset/2.0.6-SNAPSHOT/pom.xml
[INFO] ------------------------------------------------------------------------
[ERROR] BUILD FAILURE
[INFO] ------------------------------------------------------------------------
[INFO] Compilation failure
<http://dhis.uio.no/ci/job/Dhis2%20Web%20Trunk/ws/dhis-2/dhis-web/dhis-web-maintenance/dhis-web-maintenance-dataset/src/main/java/org/hisp/dhis/dataset/action/dataentryform/ViewDataEntryFormAction.java>:[174,80] cannot find symbol
symbol : method getFullOperands(java.util.Collection<org.hisp.dhis.dataelement.DataElement>)
location: interface org.hisp.dhis.dataelement.DataElementCategoryService

[INFO] ------------------------------------------------------------------------
[INFO] For more information, run Maven with the -e switch
[INFO] ------------------------------------------------------------------------
[INFO] Total time: 2 minutes 39 seconds
[INFO] Finished at: Fri Oct 08 12:20:31 CEST 2010
[INFO] Final Memory: 97M/279M
[INFO] ------------------------------------------------------------------------
Waiting for Hudson to finish collecting data
Failed to send e-mail to Tri Tran Thanh because no e-mail address is known, and no default e-mail domain is configured
Sending e-mails to: dhis2-devs@lists.launchpad.net
channel stopped
Archiving artifacts
Performing Post build task...
Could not match :DHIS Web Portal ....................................... SUCCESS : False
Logical operation result is FALSE
Skipping script : echo "Building webapp succeeded. Deploying to dev"
/ifi/utgard/p01/dhis/bin/redeploy-dhis-snapshot
END OF POST BUILD TASK : 0
Failed to send e-mail to Tri Tran Thanh because no e-mail address is known, and no default e-mail domain is configured
Failed to send e-mail to Mithilesh Kumar Thakur because no e-mail address is known, and no default e-mail domain is configured

See <http://dhis.uio.no/ci/job/Dhis2%20Web%20Trunk/1249/changes>