Build failed in Hudson: Dhis2 Service Trunk #1774

See <http://dhis.uio.no/ci/job/Dhis2%20Service%20Trunk/1774/changes>

Changes:

[Lars Helge Overland] Applied patch from Tran on import of dataentryform

···

------------------------------------------
[...truncated 1087 lines...]
[INFO] <http://dhis.uio.no/ci/job/Dhis2%20Service%20Trunk/ws/dhis-2/dhis-services/dhis-service-aggregationengine-default/target/test-classes>
[INFO] No effort provided, using default effort.
[INFO] Adding Source Directory: <http://dhis.uio.no/ci/job/Dhis2%20Service%20Trunk/ws/dhis-2/dhis-services/dhis-service-aggregationengine-default/src/main/java>
[INFO] No threshold provided, using default threshold.
[INFO] Using FindBugs Version: 1.3.8
[INFO] No threshold provided, using default threshold.
[INFO] No threshold provided, using default threshold.
[INFO] No threshold provided, using default threshold.
[INFO] Using the xdoc format
[INFO] No effort provided, using default effort.
[INFO] No threshold provided, using default threshold.
[INFO] No threshold provided, using default threshold.
[INFO] Debugging is Off
[INFO] No bug include filter.
[INFO] Using bug exclude filter /tmp/plexus-resources1122196697tmp
[FINDBUGS] Successfully parsed file <http://dhis.uio.no/ci/job/Dhis2%20Service%20Trunk/ws/dhis-2/dhis-services/dhis-service-aggregationengine-default/target/findbugsXml.xml> of module DHIS Aggregation Service - Default with 10 warnings.
[INFO] Printing Errors
[INFO] Printing Missing classes
[INFO] Printing Source Roots
[INFO] ------------------------------------------------------------------------
[INFO] Building DHIS OrganisationUnit API Implementations
[INFO] task-segment: [clean, install, findbugs:findbugs]
[INFO] ------------------------------------------------------------------------
[INFO] [clean:clean {execution: default-clean}]
[INFO] Deleting directory <http://dhis.uio.no/ci/job/Dhis2%20Service%20Trunk/ws/dhis-2/dhis-services/dhis-service-mapping/target>
[INFO] [resources:resources {execution: default-resources}]
[INFO] Using encoding: 'UTF-8' to copy filtered resources.
[INFO] [compiler:compile {execution: default-compile}]
[INFO] Compiling 4 source files to <http://dhis.uio.no/ci/job/Dhis2%20Service%20Trunk/ws/dhis-2/dhis-services/dhis-service-mapping/target/classes>
[INFO] [resources:testResources {execution: default-testResources}]
[INFO] Using encoding: 'UTF-8' to copy filtered resources.
[INFO] [compiler:testCompile {execution: default-testCompile}]
[INFO] Compiling 2 source files to <http://dhis.uio.no/ci/job/Dhis2%20Service%20Trunk/ws/dhis-2/dhis-services/dhis-service-mapping/target/test-classes>
[INFO] [surefire:test {execution: default-test}]
[INFO] Surefire report directory: <http://dhis.uio.no/ci/job/Dhis2%20Service%20Trunk/ws/dhis-2/dhis-services/dhis-service-mapping/target/surefire-reports>

-------------------------------------------------------
T E S T S
-------------------------------------------------------
Running org.hisp.dhis.mapping.MappingServiceTest
Tests run: 2, Failures: 0, Errors: 0, Skipped: 0, Time elapsed: 30.516 sec
Running org.hisp.dhis.mapping.MappingStoreTest
Tests run: 1, Failures: 0, Errors: 0, Skipped: 0, Time elapsed: 0.66 sec

Results :

Tests run: 3, Failures: 0, Errors: 0, Skipped: 0

[HUDSON] Recording test results
[INFO] [jar:jar {execution: default-jar}]
[INFO] Building jar: <http://dhis.uio.no/ci/job/Dhis2%20Service%20Trunk/ws/dhis-2/dhis-services/dhis-service-mapping/target/dhis-service-mapping-2.0.6-SNAPSHOT.jar>
[INFO] [install:install {execution: default-install}]
[INFO] Installing <http://dhis.uio.no/ci/job/Dhis2%20Service%20Trunk/ws/dhis-2/dhis-services/dhis-service-mapping/target/dhis-service-mapping-2.0.6-SNAPSHOT.jar> to /ifi/utgard/p01/dhis/.m2/repository/org/hisp/dhis/dhis-service-mapping/2.0.6-SNAPSHOT/dhis-service-mapping-2.0.6-SNAPSHOT.jar
[INFO] Preparing findbugs:findbugs
[HUDSON] Archiving <http://dhis.uio.no/ci/job/Dhis2%20Service%20Trunk/ws/dhis-2/dhis-services/dhis-service-mapping/pom.xml> to /ifi/utgard/p01/dhis/projects/dhis-dev.ifi.uio.no/ci/home/jobs/Dhis2 Service Trunk/modules/org.hisp.dhis$dhis-service-mapping/builds/2010-12-23_13-01-58/archive/org.hisp.dhis/dhis-service-mapping/2.0.6-SNAPSHOT/pom.xml
[HUDSON] Archiving <http://dhis.uio.no/ci/job/Dhis2%20Service%20Trunk/ws/dhis-2/dhis-services/dhis-service-mapping/target/dhis-service-mapping-2.0.6-SNAPSHOT.jar> to /ifi/utgard/p01/dhis/projects/dhis-dev.ifi.uio.no/ci/home/jobs/Dhis2 Service Trunk/modules/org.hisp.dhis$dhis-service-mapping/builds/2010-12-23_13-01-58/archive/org.hisp.dhis/dhis-service-mapping/2.0.6-SNAPSHOT/dhis-service-mapping-2.0.6-SNAPSHOT.jar
[INFO] [resources:resources {execution: default-resources}]
[INFO] Using encoding: 'UTF-8' to copy filtered resources.
[INFO] [compiler:compile {execution: default-compile}]
[INFO] Nothing to compile - all classes are up to date
[INFO] [findbugs:findbugs {execution: default-cli}]
[INFO] Using source root:
[INFO] <http://dhis.uio.no/ci/job/Dhis2%20Service%20Trunk/ws/dhis-2/dhis-services/dhis-service-mapping/target/classes>
[INFO] Using test source root:
[INFO] <http://dhis.uio.no/ci/job/Dhis2%20Service%20Trunk/ws/dhis-2/dhis-services/dhis-service-mapping/target/test-classes>
[INFO] No effort provided, using default effort.
[INFO] Adding Source Directory: <http://dhis.uio.no/ci/job/Dhis2%20Service%20Trunk/ws/dhis-2/dhis-services/dhis-service-mapping/src/main/java>
[INFO] No threshold provided, using default threshold.
[INFO] Using FindBugs Version: 1.3.8
[INFO] No threshold provided, using default threshold.
[INFO] No threshold provided, using default threshold.
[INFO] No threshold provided, using default threshold.
[INFO] Using the xdoc format
[INFO] No effort provided, using default effort.
[INFO] No threshold provided, using default threshold.
[INFO] No threshold provided, using default threshold.
[INFO] Debugging is Off
[INFO] No bug include filter.
[INFO] Using bug exclude filter /tmp/plexus-resources925215080tmp
[INFO] Printing Errors
[INFO] Printing Missing classes
[INFO] Printing Source Roots
[FINDBUGS] Successfully parsed file <http://dhis.uio.no/ci/job/Dhis2%20Service%20Trunk/ws/dhis-2/dhis-services/dhis-service-mapping/target/findbugsXml.xml> of module DHIS OrganisationUnit API Implementations with 0 warnings.
[INFO] ------------------------------------------------------------------------
[INFO] Building DHIS Reporting Service
[INFO] task-segment: [clean, install, findbugs:findbugs]
[INFO] ------------------------------------------------------------------------
[INFO] [clean:clean {execution: default-clean}]
[INFO] Deleting directory <http://dhis.uio.no/ci/job/Dhis2%20Service%20Trunk/ws/dhis-2/dhis-services/dhis-service-reporting/target>
[INFO] [resources:resources {execution: default-resources}]
[INFO] Using encoding: 'UTF-8' to copy filtered resources.
[INFO] [compiler:compile {execution: default-compile}]
[INFO] Compiling 38 source files to <http://dhis.uio.no/ci/job/Dhis2%20Service%20Trunk/ws/dhis-2/dhis-services/dhis-service-reporting/target/classes>
[INFO] [resources:testResources {execution: default-testResources}]
[INFO] Using encoding: 'UTF-8' to copy filtered resources.
[INFO] [compiler:testCompile {execution: default-testCompile}]
[INFO] Compiling 21 source files to <http://dhis.uio.no/ci/job/Dhis2%20Service%20Trunk/ws/dhis-2/dhis-services/dhis-service-reporting/target/test-classes>
[INFO] [surefire:test {execution: default-test}]
[INFO] Surefire report directory: <http://dhis.uio.no/ci/job/Dhis2%20Service%20Trunk/ws/dhis-2/dhis-services/dhis-service-reporting/target/surefire-reports>

-------------------------------------------------------
T E S T S
-------------------------------------------------------
Running org.hisp.dhis.reporttable.ReportTableStoreTest
Tests run: 4, Failures: 0, Errors: 0, Skipped: 0, Time elapsed: 37.762 sec
Running org.hisp.dhis.report.ReportManagerTest
Tests run: 1, Failures: 0, Errors: 0, Skipped: 0, Time elapsed: 1.275 sec
Running org.hisp.dhis.completeness.DataSetCompletenessServiceTest
Tests run: 9, Failures: 0, Errors: 0, Skipped: 1, Time elapsed: 5.334 sec
Running org.hisp.dhis.reporttable.ReportTableStatementTest
Tests run: 6, Failures: 0, Errors: 0, Skipped: 0, Time elapsed: 0.698 sec
Running org.hisp.dhis.reporttable.ReportTableTest
Tests run: 12, Failures: 0, Errors: 0, Skipped: 0, Time elapsed: 0.78 sec
Running org.hisp.dhis.report.ReportStoreTest
Tests run: 4, Failures: 0, Errors: 0, Skipped: 0, Time elapsed: 0.305 sec
Running org.hisp.dhis.orgunitdistribution.OrgUnitDistributionServiceTest
Tests run: 1, Failures: 0, Errors: 0, Skipped: 0, Time elapsed: 0.102 sec
Running org.hisp.dhis.olap.OlapURLStoreTest
Tests run: 3, Failures: 0, Errors: 0, Skipped: 0, Time elapsed: 0.196 sec
Running org.hisp.dhis.olap.OlapURLServiceTest
Tests run: 1, Failures: 0, Errors: 0, Skipped: 0, Time elapsed: 0.099 sec
Running org.hisp.dhis.reporttable.ReportTableManagerTest
Tests run: 6, Failures: 0, Errors: 0, Skipped: 0, Time elapsed: 0.668 sec
Running org.hisp.dhis.chart.ChartStoreTest
Tests run: 4, Failures: 0, Errors: 0, Skipped: 0, Time elapsed: 0.659 sec
Running org.hisp.dhis.document.DocumentStoreTest
Tests run: 4, Failures: 0, Errors: 0, Skipped: 0, Time elapsed: 0.238 sec
Running org.hisp.dhis.chart.ChartServiceTest
Tests run: 5, Failures: 0, Errors: 0, Skipped: 0, Time elapsed: 2.022 sec
Running org.hisp.dhis.workbook.WorkbookServiceTest
Tests run: 3, Failures: 0, Errors: 0, Skipped: 0, Time elapsed: 3.697 sec
Running org.hisp.dhis.document.DocumentServiceTest
Tests run: 4, Failures: 0, Errors: 0, Skipped: 0, Time elapsed: 0.314 sec
Running org.hisp.dhis.reporttable.ReportTableServiceTest
Tests run: 12, Failures: 0, Errors: 0, Skipped: 0, Time elapsed: 3.499 sec
Running org.hisp.dhis.workbook.tallysheet.TallySheetServiceTest
Tests run: 2, Failures: 0, Errors: 0, Skipped: 0, Time elapsed: 0.356 sec
Running org.hisp.dhis.pdf.PdfServiceTest
Tests run: 3, Failures: 0, Errors: 0, Skipped: 0, Time elapsed: 1.2 sec
Running org.hisp.dhis.dashboard.DashboardStoreTest
Tests run: 4, Failures: 0, Errors: 0, Skipped: 0, Time elapsed: 0.383 sec
Running org.hisp.dhis.completeness.DataSetCompletenessServiceExportTest
Tests run: 1, Failures: 0, Errors: 0, Skipped: 0, Time elapsed: 0.352 sec

Results :

Tests run: 89, Failures: 0, Errors: 0, Skipped: 1

[HUDSON] Recording test results
[INFO] [jar:jar {execution: default-jar}]
[INFO] Building jar: <http://dhis.uio.no/ci/job/Dhis2%20Service%20Trunk/ws/dhis-2/dhis-services/dhis-service-reporting/target/dhis-service-reporting-2.0.6-SNAPSHOT.jar>
[INFO] [install:install {execution: default-install}]
[INFO] Installing <http://dhis.uio.no/ci/job/Dhis2%20Service%20Trunk/ws/dhis-2/dhis-services/dhis-service-reporting/target/dhis-service-reporting-2.0.6-SNAPSHOT.jar> to /ifi/utgard/p01/dhis/.m2/repository/org/hisp/dhis/dhis-service-reporting/2.0.6-SNAPSHOT/dhis-service-reporting-2.0.6-SNAPSHOT.jar
[INFO] Preparing findbugs:findbugs
[HUDSON] Archiving <http://dhis.uio.no/ci/job/Dhis2%20Service%20Trunk/ws/dhis-2/dhis-services/dhis-service-reporting/pom.xml> to /ifi/utgard/p01/dhis/projects/dhis-dev.ifi.uio.no/ci/home/jobs/Dhis2 Service Trunk/modules/org.hisp.dhis$dhis-service-reporting/builds/2010-12-23_13-01-58/archive/org.hisp.dhis/dhis-service-reporting/2.0.6-SNAPSHOT/pom.xml
[HUDSON] Archiving <http://dhis.uio.no/ci/job/Dhis2%20Service%20Trunk/ws/dhis-2/dhis-services/dhis-service-reporting/target/dhis-service-reporting-2.0.6-SNAPSHOT.jar> to /ifi/utgard/p01/dhis/projects/dhis-dev.ifi.uio.no/ci/home/jobs/Dhis2 Service Trunk/modules/org.hisp.dhis$dhis-service-reporting/builds/2010-12-23_13-01-58/archive/org.hisp.dhis/dhis-service-reporting/2.0.6-SNAPSHOT/dhis-service-reporting-2.0.6-SNAPSHOT.jar
[INFO] [resources:resources {execution: default-resources}]
[INFO] Using encoding: 'UTF-8' to copy filtered resources.
[INFO] [compiler:compile {execution: default-compile}]
[INFO] Nothing to compile - all classes are up to date
[INFO] [findbugs:findbugs {execution: default-cli}]
[INFO] Using source root:
[INFO] <http://dhis.uio.no/ci/job/Dhis2%20Service%20Trunk/ws/dhis-2/dhis-services/dhis-service-reporting/target/classes>
[INFO] Using test source root:
[INFO] <http://dhis.uio.no/ci/job/Dhis2%20Service%20Trunk/ws/dhis-2/dhis-services/dhis-service-reporting/target/test-classes>
[INFO] No effort provided, using default effort.
[INFO] Adding Source Directory: <http://dhis.uio.no/ci/job/Dhis2%20Service%20Trunk/ws/dhis-2/dhis-services/dhis-service-reporting/src/main/java>
[INFO] No threshold provided, using default threshold.
[INFO] Using FindBugs Version: 1.3.8
[INFO] No threshold provided, using default threshold.
[INFO] No threshold provided, using default threshold.
[INFO] No threshold provided, using default threshold.
[INFO] Using the xdoc format
[INFO] No effort provided, using default effort.
[INFO] No threshold provided, using default threshold.
[INFO] No threshold provided, using default threshold.
[INFO] Debugging is Off
[INFO] No bug include filter.
[INFO] Using bug exclude filter /tmp/plexus-resources128855552tmp
[INFO] Printing Errors
[INFO] Printing Missing classes
[INFO] Printing Source Roots
[FINDBUGS] Successfully parsed file <http://dhis.uio.no/ci/job/Dhis2%20Service%20Trunk/ws/dhis-2/dhis-services/dhis-service-reporting/target/findbugsXml.xml> of module DHIS Reporting Service with 17 warnings.
[INFO] ------------------------------------------------------------------------
[INFO] Building DHIS Import-Export Service
[INFO] task-segment: [clean, install, findbugs:findbugs]
[INFO] ------------------------------------------------------------------------
[INFO] [clean:clean {execution: default-clean}]
[INFO] Deleting directory <http://dhis.uio.no/ci/job/Dhis2%20Service%20Trunk/ws/dhis-2/dhis-services/dhis-service-importexport/target>
[INFO] [resources:resources {execution: default-resources}]
[INFO] Using encoding: 'UTF-8' to copy filtered resources.
[INFO] [compiler:compile {execution: default-compile}]
[INFO] Compiling 223 source files to <http://dhis.uio.no/ci/job/Dhis2%20Service%20Trunk/ws/dhis-2/dhis-services/dhis-service-importexport/target/classes>
[HUDSON] Archiving <http://dhis.uio.no/ci/job/Dhis2%20Service%20Trunk/ws/dhis-2/dhis-services/dhis-service-importexport/pom.xml> to /ifi/utgard/p01/dhis/projects/dhis-dev.ifi.uio.no/ci/home/jobs/Dhis2 Service Trunk/modules/org.hisp.dhis$dhis-service-importexport/builds/2010-12-23_13-01-58/archive/org.hisp.dhis/dhis-service-importexport/2.0.6-SNAPSHOT/pom.xml
[INFO] ------------------------------------------------------------------------
[ERROR] BUILD FAILURE
[INFO] ------------------------------------------------------------------------
[INFO] Compilation failure

<http://dhis.uio.no/ci/job/Dhis2%20Service%20Trunk/ws/dhis-2/dhis-services/dhis-service-importexport/src/main/java/org/hisp/dhis/importexport/dxf/converter/DXFConverter.java>:[94,38] cannot find symbol
symbol : class DataEntryFormBatchHandler
location: package org.hisp.dhis.jdbc.batchhandler

<http://dhis.uio.no/ci/job/Dhis2%20Service%20Trunk/ws/dhis-2/dhis-services/dhis-service-importexport/src/main/java/org/hisp/dhis/importexport/dxf/exporter/DefaultDXFExportService.java>:[80,47] cannot find symbol
symbol : class DataEntryFormConverter
location: package org.hisp.dhis.importexport.dxf.converter

<http://dhis.uio.no/ci/job/Dhis2%20Service%20Trunk/ws/dhis-2/dhis-services/dhis-service-importexport/src/main/java/org/hisp/dhis/importexport/service/DefaultImportObjectManager.java>:[83,42] cannot find symbol
symbol : class DataEntryFormImporter
location: package org.hisp.dhis.importexport.importer

<http://dhis.uio.no/ci/job/Dhis2%20Service%20Trunk/ws/dhis-2/dhis-services/dhis-service-importexport/src/main/java/org/hisp/dhis/importexport/mapping/DefaultObjectMappingGenerator.java>:[59,38] cannot find symbol
symbol : class DataEntryFormBatchHandler
location: package org.hisp.dhis.jdbc.batchhandler

<http://dhis.uio.no/ci/job/Dhis2%20Service%20Trunk/ws/dhis-2/dhis-services/dhis-service-importexport/src/main/java/org/hisp/dhis/importexport/dxf/converter/DXFConverter.java>:[730,45] cannot find symbol
symbol : variable DataEntryFormConverter
location: class org.hisp.dhis.importexport.dxf.converter.DXFConverter

<http://dhis.uio.no/ci/job/Dhis2%20Service%20Trunk/ws/dhis-2/dhis-services/dhis-service-importexport/src/main/java/org/hisp/dhis/importexport/dxf/converter/DXFConverter.java>:[735,20] cannot find symbol
symbol : class DataEntryFormBatchHandler
location: class org.hisp.dhis.importexport.dxf.converter.DXFConverter

<http://dhis.uio.no/ci/job/Dhis2%20Service%20Trunk/ws/dhis-2/dhis-services/dhis-service-importexport/src/main/java/org/hisp/dhis/importexport/dxf/converter/DXFConverter.java>:[737,45] cannot find symbol
symbol : class DataEntryFormConverter
location: class org.hisp.dhis.importexport.dxf.converter.DXFConverter

<http://dhis.uio.no/ci/job/Dhis2%20Service%20Trunk/ws/dhis-2/dhis-services/dhis-service-importexport/src/main/java/org/hisp/dhis/importexport/dxf/exporter/DefaultDXFExportService.java>:[331,45] cannot find symbol
symbol : class DataEntryFormConverter
location: class org.hisp.dhis.importexport.dxf.exporter.DefaultDXFExportService

<http://dhis.uio.no/ci/job/Dhis2%20Service%20Trunk/ws/dhis-2/dhis-services/dhis-service-importexport/src/main/java/org/hisp/dhis/importexport/service/DefaultImportObjectManager.java>:[1154,47] cannot find symbol
symbol : class DataEntryFormImporter
location: class org.hisp.dhis.importexport.service.DefaultImportObjectManager

<http://dhis.uio.no/ci/job/Dhis2%20Service%20Trunk/ws/dhis-2/dhis-services/dhis-service-importexport/src/main/java/org/hisp/dhis/importexport/mapping/DefaultObjectMappingGenerator.java>:[270,91] cannot find symbol
symbol : class DataEntryFormBatchHandler
location: class org.hisp.dhis.importexport.mapping.DefaultObjectMappingGenerator

[INFO] ------------------------------------------------------------------------
[INFO] For more information, run Maven with the -e switch
[INFO] ------------------------------------------------------------------------
[INFO] Total time: 12 minutes 24 seconds
[INFO] Finished at: Thu Dec 23 13:14:29 CET 2010
[INFO] Final Memory: 195M/465M
[INFO] ------------------------------------------------------------------------
Sending e-mails to: dhis2-devs@lists.launchpad.net
channel stopped

See <http://dhis.uio.no/ci/job/Dhis2%20Service%20Trunk/1775/changes>

Changes:

[Jo Størset] Ported user group functionality to user maintainance and tried to clean up a bit

···

------------------------------------------
[...truncated 1101 lines...]
[INFO] <http://dhis.uio.no/ci/job/Dhis2%20Service%20Trunk/ws/dhis-2/dhis-services/dhis-service-aggregationengine-default/target/test-classes>
[INFO] No effort provided, using default effort.
[INFO] Adding Source Directory: <http://dhis.uio.no/ci/job/Dhis2%20Service%20Trunk/ws/dhis-2/dhis-services/dhis-service-aggregationengine-default/src/main/java>
[INFO] No threshold provided, using default threshold.
[INFO] Using FindBugs Version: 1.3.8
[INFO] No threshold provided, using default threshold.
[INFO] No threshold provided, using default threshold.
[INFO] No threshold provided, using default threshold.
[INFO] Using the xdoc format
[INFO] No effort provided, using default effort.
[INFO] No threshold provided, using default threshold.
[INFO] No threshold provided, using default threshold.
[INFO] Debugging is Off
[INFO] No bug include filter.
[INFO] Using bug exclude filter /tmp/plexus-resources1063171416tmp
[FINDBUGS] Successfully parsed file <http://dhis.uio.no/ci/job/Dhis2%20Service%20Trunk/ws/dhis-2/dhis-services/dhis-service-aggregationengine-default/target/findbugsXml.xml> of module DHIS Aggregation Service - Default with 10 warnings.
[INFO] Printing Errors
[INFO] Printing Missing classes
[INFO] Printing Source Roots
[INFO] ------------------------------------------------------------------------
[INFO] Building DHIS OrganisationUnit API Implementations
[INFO] task-segment: [clean, install, findbugs:findbugs]
[INFO] ------------------------------------------------------------------------
[INFO] [clean:clean {execution: default-clean}]
[INFO] Deleting directory <http://dhis.uio.no/ci/job/Dhis2%20Service%20Trunk/ws/dhis-2/dhis-services/dhis-service-mapping/target>
[INFO] [resources:resources {execution: default-resources}]
[INFO] Using encoding: 'UTF-8' to copy filtered resources.
[INFO] [compiler:compile {execution: default-compile}]
[INFO] Compiling 4 source files to <http://dhis.uio.no/ci/job/Dhis2%20Service%20Trunk/ws/dhis-2/dhis-services/dhis-service-mapping/target/classes>
[INFO] [resources:testResources {execution: default-testResources}]
[INFO] Using encoding: 'UTF-8' to copy filtered resources.
[INFO] [compiler:testCompile {execution: default-testCompile}]
[INFO] Compiling 2 source files to <http://dhis.uio.no/ci/job/Dhis2%20Service%20Trunk/ws/dhis-2/dhis-services/dhis-service-mapping/target/test-classes>
[INFO] [surefire:test {execution: default-test}]
[INFO] Surefire report directory: <http://dhis.uio.no/ci/job/Dhis2%20Service%20Trunk/ws/dhis-2/dhis-services/dhis-service-mapping/target/surefire-reports>

-------------------------------------------------------
T E S T S
-------------------------------------------------------
Running org.hisp.dhis.mapping.MappingServiceTest
Tests run: 2, Failures: 0, Errors: 0, Skipped: 0, Time elapsed: 30.181 sec
Running org.hisp.dhis.mapping.MappingStoreTest
Tests run: 1, Failures: 0, Errors: 0, Skipped: 0, Time elapsed: 0.671 sec

Results :

Tests run: 3, Failures: 0, Errors: 0, Skipped: 0

[HUDSON] Recording test results
[INFO] [jar:jar {execution: default-jar}]
[INFO] Building jar: <http://dhis.uio.no/ci/job/Dhis2%20Service%20Trunk/ws/dhis-2/dhis-services/dhis-service-mapping/target/dhis-service-mapping-2.0.6-SNAPSHOT.jar>
[INFO] [install:install {execution: default-install}]
[INFO] Installing <http://dhis.uio.no/ci/job/Dhis2%20Service%20Trunk/ws/dhis-2/dhis-services/dhis-service-mapping/target/dhis-service-mapping-2.0.6-SNAPSHOT.jar> to /ifi/utgard/p01/dhis/.m2/repository/org/hisp/dhis/dhis-service-mapping/2.0.6-SNAPSHOT/dhis-service-mapping-2.0.6-SNAPSHOT.jar
[INFO] Preparing findbugs:findbugs
[HUDSON] Archiving <http://dhis.uio.no/ci/job/Dhis2%20Service%20Trunk/ws/dhis-2/dhis-services/dhis-service-mapping/pom.xml> to /ifi/utgard/p01/dhis/projects/dhis-dev.ifi.uio.no/ci/home/jobs/Dhis2 Service Trunk/modules/org.hisp.dhis$dhis-service-mapping/builds/2010-12-23_13-31-42/archive/org.hisp.dhis/dhis-service-mapping/2.0.6-SNAPSHOT/pom.xml
[HUDSON] Archiving <http://dhis.uio.no/ci/job/Dhis2%20Service%20Trunk/ws/dhis-2/dhis-services/dhis-service-mapping/target/dhis-service-mapping-2.0.6-SNAPSHOT.jar> to /ifi/utgard/p01/dhis/projects/dhis-dev.ifi.uio.no/ci/home/jobs/Dhis2 Service Trunk/modules/org.hisp.dhis$dhis-service-mapping/builds/2010-12-23_13-31-42/archive/org.hisp.dhis/dhis-service-mapping/2.0.6-SNAPSHOT/dhis-service-mapping-2.0.6-SNAPSHOT.jar
[INFO] [resources:resources {execution: default-resources}]
[INFO] Using encoding: 'UTF-8' to copy filtered resources.
[INFO] [compiler:compile {execution: default-compile}]
[INFO] Nothing to compile - all classes are up to date
[INFO] [findbugs:findbugs {execution: default-cli}]
[INFO] Using source root:
[INFO] <http://dhis.uio.no/ci/job/Dhis2%20Service%20Trunk/ws/dhis-2/dhis-services/dhis-service-mapping/target/classes>
[INFO] Using test source root:
[INFO] <http://dhis.uio.no/ci/job/Dhis2%20Service%20Trunk/ws/dhis-2/dhis-services/dhis-service-mapping/target/test-classes>
[INFO] No effort provided, using default effort.
[INFO] Adding Source Directory: <http://dhis.uio.no/ci/job/Dhis2%20Service%20Trunk/ws/dhis-2/dhis-services/dhis-service-mapping/src/main/java>
[INFO] No threshold provided, using default threshold.
[INFO] Using FindBugs Version: 1.3.8
[INFO] No threshold provided, using default threshold.
[INFO] No threshold provided, using default threshold.
[INFO] No threshold provided, using default threshold.
[INFO] Using the xdoc format
[INFO] No effort provided, using default effort.
[INFO] No threshold provided, using default threshold.
[INFO] No threshold provided, using default threshold.
[INFO] Debugging is Off
[INFO] No bug include filter.
[INFO] Using bug exclude filter /tmp/plexus-resources632978276tmp
[FINDBUGS] Successfully parsed file <http://dhis.uio.no/ci/job/Dhis2%20Service%20Trunk/ws/dhis-2/dhis-services/dhis-service-mapping/target/findbugsXml.xml> of module DHIS OrganisationUnit API Implementations with 0 warnings.
[INFO] Printing Errors
[INFO] Printing Missing classes
[INFO] Printing Source Roots
[INFO] ------------------------------------------------------------------------
[INFO] Building DHIS Reporting Service
[INFO] task-segment: [clean, install, findbugs:findbugs]
[INFO] ------------------------------------------------------------------------
[INFO] [clean:clean {execution: default-clean}]
[INFO] Deleting directory <http://dhis.uio.no/ci/job/Dhis2%20Service%20Trunk/ws/dhis-2/dhis-services/dhis-service-reporting/target>
[INFO] [resources:resources {execution: default-resources}]
[INFO] Using encoding: 'UTF-8' to copy filtered resources.
[INFO] [compiler:compile {execution: default-compile}]
[INFO] Compiling 38 source files to <http://dhis.uio.no/ci/job/Dhis2%20Service%20Trunk/ws/dhis-2/dhis-services/dhis-service-reporting/target/classes>
[INFO] [resources:testResources {execution: default-testResources}]
[INFO] Using encoding: 'UTF-8' to copy filtered resources.
[INFO] [compiler:testCompile {execution: default-testCompile}]
[INFO] Compiling 21 source files to <http://dhis.uio.no/ci/job/Dhis2%20Service%20Trunk/ws/dhis-2/dhis-services/dhis-service-reporting/target/test-classes>
[INFO] [surefire:test {execution: default-test}]
[INFO] Surefire report directory: <http://dhis.uio.no/ci/job/Dhis2%20Service%20Trunk/ws/dhis-2/dhis-services/dhis-service-reporting/target/surefire-reports>

-------------------------------------------------------
T E S T S
-------------------------------------------------------
Running org.hisp.dhis.reporttable.ReportTableStoreTest
Tests run: 4, Failures: 0, Errors: 0, Skipped: 0, Time elapsed: 37.527 sec
Running org.hisp.dhis.report.ReportManagerTest
Tests run: 1, Failures: 0, Errors: 0, Skipped: 0, Time elapsed: 1.167 sec
Running org.hisp.dhis.completeness.DataSetCompletenessServiceTest
Tests run: 9, Failures: 0, Errors: 0, Skipped: 1, Time elapsed: 4.902 sec
Running org.hisp.dhis.reporttable.ReportTableStatementTest
Tests run: 6, Failures: 0, Errors: 0, Skipped: 0, Time elapsed: 0.655 sec
Running org.hisp.dhis.reporttable.ReportTableTest
Tests run: 12, Failures: 0, Errors: 0, Skipped: 0, Time elapsed: 0.826 sec
Running org.hisp.dhis.report.ReportStoreTest
Tests run: 4, Failures: 0, Errors: 0, Skipped: 0, Time elapsed: 0.286 sec
Running org.hisp.dhis.orgunitdistribution.OrgUnitDistributionServiceTest
Tests run: 1, Failures: 0, Errors: 0, Skipped: 0, Time elapsed: 0.097 sec
Running org.hisp.dhis.olap.OlapURLStoreTest
Tests run: 3, Failures: 0, Errors: 0, Skipped: 0, Time elapsed: 0.177 sec
Running org.hisp.dhis.olap.OlapURLServiceTest
Tests run: 1, Failures: 0, Errors: 0, Skipped: 0, Time elapsed: 0.099 sec
Running org.hisp.dhis.reporttable.ReportTableManagerTest
Tests run: 6, Failures: 0, Errors: 0, Skipped: 0, Time elapsed: 0.631 sec
Running org.hisp.dhis.chart.ChartStoreTest
Tests run: 4, Failures: 0, Errors: 0, Skipped: 0, Time elapsed: 0.663 sec
Running org.hisp.dhis.document.DocumentStoreTest
Tests run: 4, Failures: 0, Errors: 0, Skipped: 0, Time elapsed: 0.221 sec
Running org.hisp.dhis.chart.ChartServiceTest
Tests run: 5, Failures: 0, Errors: 0, Skipped: 0, Time elapsed: 1.782 sec
Running org.hisp.dhis.workbook.WorkbookServiceTest
Tests run: 3, Failures: 0, Errors: 0, Skipped: 0, Time elapsed: 3.558 sec
Running org.hisp.dhis.document.DocumentServiceTest
Tests run: 4, Failures: 0, Errors: 0, Skipped: 0, Time elapsed: 0.332 sec
Running org.hisp.dhis.reporttable.ReportTableServiceTest
Tests run: 12, Failures: 0, Errors: 0, Skipped: 0, Time elapsed: 3.467 sec
Running org.hisp.dhis.workbook.tallysheet.TallySheetServiceTest
Tests run: 2, Failures: 0, Errors: 0, Skipped: 0, Time elapsed: 0.395 sec
Running org.hisp.dhis.pdf.PdfServiceTest
Tests run: 3, Failures: 0, Errors: 0, Skipped: 0, Time elapsed: 1.466 sec
Running org.hisp.dhis.dashboard.DashboardStoreTest
Tests run: 4, Failures: 0, Errors: 0, Skipped: 0, Time elapsed: 0.303 sec
Running org.hisp.dhis.completeness.DataSetCompletenessServiceExportTest
Tests run: 1, Failures: 0, Errors: 0, Skipped: 0, Time elapsed: 0.294 sec

Results :

Tests run: 89, Failures: 0, Errors: 0, Skipped: 1

[HUDSON] Recording test results
[INFO] [jar:jar {execution: default-jar}]
[INFO] Building jar: <http://dhis.uio.no/ci/job/Dhis2%20Service%20Trunk/ws/dhis-2/dhis-services/dhis-service-reporting/target/dhis-service-reporting-2.0.6-SNAPSHOT.jar>
[INFO] [install:install {execution: default-install}]
[INFO] Installing <http://dhis.uio.no/ci/job/Dhis2%20Service%20Trunk/ws/dhis-2/dhis-services/dhis-service-reporting/target/dhis-service-reporting-2.0.6-SNAPSHOT.jar> to /ifi/utgard/p01/dhis/.m2/repository/org/hisp/dhis/dhis-service-reporting/2.0.6-SNAPSHOT/dhis-service-reporting-2.0.6-SNAPSHOT.jar
[INFO] Preparing findbugs:findbugs
[HUDSON] Archiving <http://dhis.uio.no/ci/job/Dhis2%20Service%20Trunk/ws/dhis-2/dhis-services/dhis-service-reporting/pom.xml> to /ifi/utgard/p01/dhis/projects/dhis-dev.ifi.uio.no/ci/home/jobs/Dhis2 Service Trunk/modules/org.hisp.dhis$dhis-service-reporting/builds/2010-12-23_13-31-42/archive/org.hisp.dhis/dhis-service-reporting/2.0.6-SNAPSHOT/pom.xml
[HUDSON] Archiving <http://dhis.uio.no/ci/job/Dhis2%20Service%20Trunk/ws/dhis-2/dhis-services/dhis-service-reporting/target/dhis-service-reporting-2.0.6-SNAPSHOT.jar> to /ifi/utgard/p01/dhis/projects/dhis-dev.ifi.uio.no/ci/home/jobs/Dhis2 Service Trunk/modules/org.hisp.dhis$dhis-service-reporting/builds/2010-12-23_13-31-42/archive/org.hisp.dhis/dhis-service-reporting/2.0.6-SNAPSHOT/dhis-service-reporting-2.0.6-SNAPSHOT.jar
[INFO] [resources:resources {execution: default-resources}]
[INFO] Using encoding: 'UTF-8' to copy filtered resources.
[INFO] [compiler:compile {execution: default-compile}]
[INFO] Nothing to compile - all classes are up to date
[INFO] [findbugs:findbugs {execution: default-cli}]
[INFO] Using source root:
[INFO] <http://dhis.uio.no/ci/job/Dhis2%20Service%20Trunk/ws/dhis-2/dhis-services/dhis-service-reporting/target/classes>
[INFO] Using test source root:
[INFO] <http://dhis.uio.no/ci/job/Dhis2%20Service%20Trunk/ws/dhis-2/dhis-services/dhis-service-reporting/target/test-classes>
[INFO] No effort provided, using default effort.
[INFO] Adding Source Directory: <http://dhis.uio.no/ci/job/Dhis2%20Service%20Trunk/ws/dhis-2/dhis-services/dhis-service-reporting/src/main/java>
[INFO] No threshold provided, using default threshold.
[INFO] Using FindBugs Version: 1.3.8
[INFO] No threshold provided, using default threshold.
[INFO] No threshold provided, using default threshold.
[INFO] No threshold provided, using default threshold.
[INFO] Using the xdoc format
[INFO] No effort provided, using default effort.
[INFO] No threshold provided, using default threshold.
[INFO] No threshold provided, using default threshold.
[INFO] Debugging is Off
[INFO] No bug include filter.
[INFO] Using bug exclude filter /tmp/plexus-resources1296363563tmp
[INFO] Printing Errors
[INFO] Printing Missing classes
[INFO] Printing Source Roots
[FINDBUGS] Successfully parsed file <http://dhis.uio.no/ci/job/Dhis2%20Service%20Trunk/ws/dhis-2/dhis-services/dhis-service-reporting/target/findbugsXml.xml> of module DHIS Reporting Service with 17 warnings.
[INFO] ------------------------------------------------------------------------
[INFO] Building DHIS Import-Export Service
[INFO] task-segment: [clean, install, findbugs:findbugs]
[INFO] ------------------------------------------------------------------------
[INFO] [clean:clean {execution: default-clean}]
[INFO] Deleting directory <http://dhis.uio.no/ci/job/Dhis2%20Service%20Trunk/ws/dhis-2/dhis-services/dhis-service-importexport/target>
[INFO] [resources:resources {execution: default-resources}]
[INFO] Using encoding: 'UTF-8' to copy filtered resources.
[INFO] [compiler:compile {execution: default-compile}]
[INFO] Compiling 223 source files to <http://dhis.uio.no/ci/job/Dhis2%20Service%20Trunk/ws/dhis-2/dhis-services/dhis-service-importexport/target/classes>
[HUDSON] Archiving <http://dhis.uio.no/ci/job/Dhis2%20Service%20Trunk/ws/dhis-2/dhis-services/dhis-service-importexport/pom.xml> to /ifi/utgard/p01/dhis/projects/dhis-dev.ifi.uio.no/ci/home/jobs/Dhis2 Service Trunk/modules/org.hisp.dhis$dhis-service-importexport/builds/2010-12-23_13-31-42/archive/org.hisp.dhis/dhis-service-importexport/2.0.6-SNAPSHOT/pom.xml
[INFO] ------------------------------------------------------------------------
[ERROR] BUILD FAILURE
[INFO] ------------------------------------------------------------------------
[INFO] Compilation failure

<http://dhis.uio.no/ci/job/Dhis2%20Service%20Trunk/ws/dhis-2/dhis-services/dhis-service-importexport/src/main/java/org/hisp/dhis/importexport/dxf/converter/DXFConverter.java>:[94,38] cannot find symbol
symbol : class DataEntryFormBatchHandler
location: package org.hisp.dhis.jdbc.batchhandler

<http://dhis.uio.no/ci/job/Dhis2%20Service%20Trunk/ws/dhis-2/dhis-services/dhis-service-importexport/src/main/java/org/hisp/dhis/importexport/dxf/exporter/DefaultDXFExportService.java>:[80,47] cannot find symbol
symbol : class DataEntryFormConverter
location: package org.hisp.dhis.importexport.dxf.converter

<http://dhis.uio.no/ci/job/Dhis2%20Service%20Trunk/ws/dhis-2/dhis-services/dhis-service-importexport/src/main/java/org/hisp/dhis/importexport/service/DefaultImportObjectManager.java>:[83,42] cannot find symbol
symbol : class DataEntryFormImporter
location: package org.hisp.dhis.importexport.importer

<http://dhis.uio.no/ci/job/Dhis2%20Service%20Trunk/ws/dhis-2/dhis-services/dhis-service-importexport/src/main/java/org/hisp/dhis/importexport/mapping/DefaultObjectMappingGenerator.java>:[59,38] cannot find symbol
symbol : class DataEntryFormBatchHandler
location: package org.hisp.dhis.jdbc.batchhandler

<http://dhis.uio.no/ci/job/Dhis2%20Service%20Trunk/ws/dhis-2/dhis-services/dhis-service-importexport/src/main/java/org/hisp/dhis/importexport/dxf/converter/DXFConverter.java>:[730,45] cannot find symbol
symbol : variable DataEntryFormConverter
location: class org.hisp.dhis.importexport.dxf.converter.DXFConverter

<http://dhis.uio.no/ci/job/Dhis2%20Service%20Trunk/ws/dhis-2/dhis-services/dhis-service-importexport/src/main/java/org/hisp/dhis/importexport/dxf/converter/DXFConverter.java>:[735,20] cannot find symbol
symbol : class DataEntryFormBatchHandler
location: class org.hisp.dhis.importexport.dxf.converter.DXFConverter

<http://dhis.uio.no/ci/job/Dhis2%20Service%20Trunk/ws/dhis-2/dhis-services/dhis-service-importexport/src/main/java/org/hisp/dhis/importexport/dxf/converter/DXFConverter.java>:[737,45] cannot find symbol
symbol : class DataEntryFormConverter
location: class org.hisp.dhis.importexport.dxf.converter.DXFConverter

<http://dhis.uio.no/ci/job/Dhis2%20Service%20Trunk/ws/dhis-2/dhis-services/dhis-service-importexport/src/main/java/org/hisp/dhis/importexport/dxf/exporter/DefaultDXFExportService.java>:[331,45] cannot find symbol
symbol : class DataEntryFormConverter
location: class org.hisp.dhis.importexport.dxf.exporter.DefaultDXFExportService

<http://dhis.uio.no/ci/job/Dhis2%20Service%20Trunk/ws/dhis-2/dhis-services/dhis-service-importexport/src/main/java/org/hisp/dhis/importexport/service/DefaultImportObjectManager.java>:[1154,47] cannot find symbol
symbol : class DataEntryFormImporter
location: class org.hisp.dhis.importexport.service.DefaultImportObjectManager

<http://dhis.uio.no/ci/job/Dhis2%20Service%20Trunk/ws/dhis-2/dhis-services/dhis-service-importexport/src/main/java/org/hisp/dhis/importexport/mapping/DefaultObjectMappingGenerator.java>:[270,91] cannot find symbol
symbol : class DataEntryFormBatchHandler
location: class org.hisp.dhis.importexport.mapping.DefaultObjectMappingGenerator

[INFO] ------------------------------------------------------------------------
[INFO] For more information, run Maven with the -e switch
[INFO] ------------------------------------------------------------------------
[INFO] Total time: 11 minutes 57 seconds
[INFO] Finished at: Thu Dec 23 13:43:45 CET 2010
[INFO] Final Memory: 194M/464M
[INFO] ------------------------------------------------------------------------
Sending e-mails to: dhis2-devs@lists.launchpad.net
channel stopped

See <http://dhis.uio.no/ci/job/Dhis2%20Service%20Trunk/1776/changes>

Changes:

[Jo Størset] Fixed test failure after org unit change

···

------------------------------------------
[...truncated 1061 lines...]
[INFO] <http://dhis.uio.no/ci/job/Dhis2%20Service%20Trunk/ws/dhis-2/dhis-services/dhis-service-aggregationengine-default/target/test-classes>
[INFO] No effort provided, using default effort.
[INFO] Adding Source Directory: <http://dhis.uio.no/ci/job/Dhis2%20Service%20Trunk/ws/dhis-2/dhis-services/dhis-service-aggregationengine-default/src/main/java>
[INFO] No threshold provided, using default threshold.
[INFO] Using FindBugs Version: 1.3.8
[INFO] No threshold provided, using default threshold.
[INFO] No threshold provided, using default threshold.
[INFO] No threshold provided, using default threshold.
[INFO] Using the xdoc format
[INFO] No effort provided, using default effort.
[INFO] No threshold provided, using default threshold.
[INFO] No threshold provided, using default threshold.
[INFO] Debugging is Off
[INFO] No bug include filter.
[INFO] Using bug exclude filter /tmp/plexus-resources1571464517tmp
[INFO] Printing Errors
[INFO] Printing Missing classes
[INFO] Printing Source Roots
[FINDBUGS] Successfully parsed file <http://dhis.uio.no/ci/job/Dhis2%20Service%20Trunk/ws/dhis-2/dhis-services/dhis-service-aggregationengine-default/target/findbugsXml.xml> of module DHIS Aggregation Service - Default with 10 warnings.
[INFO] ------------------------------------------------------------------------
[INFO] Building DHIS OrganisationUnit API Implementations
[INFO] task-segment: [clean, install, findbugs:findbugs]
[INFO] ------------------------------------------------------------------------
[INFO] [clean:clean {execution: default-clean}]
[INFO] Deleting directory <http://dhis.uio.no/ci/job/Dhis2%20Service%20Trunk/ws/dhis-2/dhis-services/dhis-service-mapping/target>
[INFO] [resources:resources {execution: default-resources}]
[INFO] Using encoding: 'UTF-8' to copy filtered resources.
[INFO] [compiler:compile {execution: default-compile}]
[INFO] Compiling 4 source files to <http://dhis.uio.no/ci/job/Dhis2%20Service%20Trunk/ws/dhis-2/dhis-services/dhis-service-mapping/target/classes>
[INFO] [resources:testResources {execution: default-testResources}]
[INFO] Using encoding: 'UTF-8' to copy filtered resources.
[INFO] [compiler:testCompile {execution: default-testCompile}]
[INFO] Compiling 2 source files to <http://dhis.uio.no/ci/job/Dhis2%20Service%20Trunk/ws/dhis-2/dhis-services/dhis-service-mapping/target/test-classes>
[INFO] [surefire:test {execution: default-test}]
[INFO] Surefire report directory: <http://dhis.uio.no/ci/job/Dhis2%20Service%20Trunk/ws/dhis-2/dhis-services/dhis-service-mapping/target/surefire-reports>

-------------------------------------------------------
T E S T S
-------------------------------------------------------
Running org.hisp.dhis.mapping.MappingServiceTest
Tests run: 2, Failures: 0, Errors: 0, Skipped: 0, Time elapsed: 29.219 sec
Running org.hisp.dhis.mapping.MappingStoreTest
Tests run: 1, Failures: 0, Errors: 0, Skipped: 0, Time elapsed: 0.618 sec

Results :

Tests run: 3, Failures: 0, Errors: 0, Skipped: 0

[HUDSON] Recording test results
[INFO] [jar:jar {execution: default-jar}]
[INFO] Building jar: <http://dhis.uio.no/ci/job/Dhis2%20Service%20Trunk/ws/dhis-2/dhis-services/dhis-service-mapping/target/dhis-service-mapping-2.0.6-SNAPSHOT.jar>
[INFO] [install:install {execution: default-install}]
[INFO] Installing <http://dhis.uio.no/ci/job/Dhis2%20Service%20Trunk/ws/dhis-2/dhis-services/dhis-service-mapping/target/dhis-service-mapping-2.0.6-SNAPSHOT.jar> to /ifi/utgard/p01/dhis/.m2/repository/org/hisp/dhis/dhis-service-mapping/2.0.6-SNAPSHOT/dhis-service-mapping-2.0.6-SNAPSHOT.jar
[INFO] Preparing findbugs:findbugs
[HUDSON] Archiving <http://dhis.uio.no/ci/job/Dhis2%20Service%20Trunk/ws/dhis-2/dhis-services/dhis-service-mapping/pom.xml> to /ifi/utgard/p01/dhis/projects/dhis-dev.ifi.uio.no/ci/home/jobs/Dhis2 Service Trunk/modules/org.hisp.dhis$dhis-service-mapping/builds/2010-12-23_19-01-44/archive/org.hisp.dhis/dhis-service-mapping/2.0.6-SNAPSHOT/pom.xml
[HUDSON] Archiving <http://dhis.uio.no/ci/job/Dhis2%20Service%20Trunk/ws/dhis-2/dhis-services/dhis-service-mapping/target/dhis-service-mapping-2.0.6-SNAPSHOT.jar> to /ifi/utgard/p01/dhis/projects/dhis-dev.ifi.uio.no/ci/home/jobs/Dhis2 Service Trunk/modules/org.hisp.dhis$dhis-service-mapping/builds/2010-12-23_19-01-44/archive/org.hisp.dhis/dhis-service-mapping/2.0.6-SNAPSHOT/dhis-service-mapping-2.0.6-SNAPSHOT.jar
[INFO] [resources:resources {execution: default-resources}]
[INFO] Using encoding: 'UTF-8' to copy filtered resources.
[INFO] [compiler:compile {execution: default-compile}]
[INFO] Nothing to compile - all classes are up to date
[INFO] [findbugs:findbugs {execution: default-cli}]
[INFO] Using source root:
[INFO] <http://dhis.uio.no/ci/job/Dhis2%20Service%20Trunk/ws/dhis-2/dhis-services/dhis-service-mapping/target/classes>
[INFO] Using test source root:
[INFO] <http://dhis.uio.no/ci/job/Dhis2%20Service%20Trunk/ws/dhis-2/dhis-services/dhis-service-mapping/target/test-classes>
[INFO] No effort provided, using default effort.
[INFO] Adding Source Directory: <http://dhis.uio.no/ci/job/Dhis2%20Service%20Trunk/ws/dhis-2/dhis-services/dhis-service-mapping/src/main/java>
[INFO] No threshold provided, using default threshold.
[INFO] Using FindBugs Version: 1.3.8
[INFO] No threshold provided, using default threshold.
[INFO] No threshold provided, using default threshold.
[INFO] No threshold provided, using default threshold.
[INFO] Using the xdoc format
[INFO] No effort provided, using default effort.
[INFO] No threshold provided, using default threshold.
[INFO] No threshold provided, using default threshold.
[INFO] Debugging is Off
[INFO] No bug include filter.
[INFO] Using bug exclude filter /tmp/plexus-resources493417800tmp
[INFO] Printing Errors
[INFO] Printing Missing classes
[INFO] Printing Source Roots
[FINDBUGS] Successfully parsed file <http://dhis.uio.no/ci/job/Dhis2%20Service%20Trunk/ws/dhis-2/dhis-services/dhis-service-mapping/target/findbugsXml.xml> of module DHIS OrganisationUnit API Implementations with 0 warnings.
[INFO] ------------------------------------------------------------------------
[INFO] Building DHIS Reporting Service
[INFO] task-segment: [clean, install, findbugs:findbugs]
[INFO] ------------------------------------------------------------------------
[INFO] [clean:clean {execution: default-clean}]
[INFO] Deleting directory <http://dhis.uio.no/ci/job/Dhis2%20Service%20Trunk/ws/dhis-2/dhis-services/dhis-service-reporting/target>
[INFO] [resources:resources {execution: default-resources}]
[INFO] Using encoding: 'UTF-8' to copy filtered resources.
[INFO] [compiler:compile {execution: default-compile}]
[INFO] Compiling 38 source files to <http://dhis.uio.no/ci/job/Dhis2%20Service%20Trunk/ws/dhis-2/dhis-services/dhis-service-reporting/target/classes>
[INFO] [resources:testResources {execution: default-testResources}]
[INFO] Using encoding: 'UTF-8' to copy filtered resources.
[INFO] [compiler:testCompile {execution: default-testCompile}]
[INFO] Compiling 21 source files to <http://dhis.uio.no/ci/job/Dhis2%20Service%20Trunk/ws/dhis-2/dhis-services/dhis-service-reporting/target/test-classes>
[INFO] [surefire:test {execution: default-test}]
[INFO] Surefire report directory: <http://dhis.uio.no/ci/job/Dhis2%20Service%20Trunk/ws/dhis-2/dhis-services/dhis-service-reporting/target/surefire-reports>

-------------------------------------------------------
T E S T S
-------------------------------------------------------
Running org.hisp.dhis.reporttable.ReportTableStoreTest
Tests run: 4, Failures: 0, Errors: 0, Skipped: 0, Time elapsed: 37.898 sec
Running org.hisp.dhis.report.ReportManagerTest
Tests run: 1, Failures: 0, Errors: 0, Skipped: 0, Time elapsed: 1.22 sec
Running org.hisp.dhis.completeness.DataSetCompletenessServiceTest
Tests run: 9, Failures: 0, Errors: 0, Skipped: 1, Time elapsed: 4.702 sec
Running org.hisp.dhis.reporttable.ReportTableStatementTest
Tests run: 6, Failures: 0, Errors: 0, Skipped: 0, Time elapsed: 1.063 sec
Running org.hisp.dhis.reporttable.ReportTableTest
Tests run: 12, Failures: 0, Errors: 0, Skipped: 0, Time elapsed: 0.842 sec
Running org.hisp.dhis.report.ReportStoreTest
Tests run: 4, Failures: 0, Errors: 0, Skipped: 0, Time elapsed: 0.287 sec
Running org.hisp.dhis.orgunitdistribution.OrgUnitDistributionServiceTest
Tests run: 1, Failures: 0, Errors: 0, Skipped: 0, Time elapsed: 0.091 sec
Running org.hisp.dhis.olap.OlapURLStoreTest
Tests run: 3, Failures: 0, Errors: 0, Skipped: 0, Time elapsed: 0.203 sec
Running org.hisp.dhis.olap.OlapURLServiceTest
Tests run: 1, Failures: 0, Errors: 0, Skipped: 0, Time elapsed: 0.101 sec
Running org.hisp.dhis.reporttable.ReportTableManagerTest
Tests run: 6, Failures: 0, Errors: 0, Skipped: 0, Time elapsed: 0.692 sec
Running org.hisp.dhis.chart.ChartStoreTest
Tests run: 4, Failures: 0, Errors: 0, Skipped: 0, Time elapsed: 0.69 sec
Running org.hisp.dhis.document.DocumentStoreTest
Tests run: 4, Failures: 0, Errors: 0, Skipped: 0, Time elapsed: 0.267 sec
Running org.hisp.dhis.chart.ChartServiceTest
Tests run: 5, Failures: 0, Errors: 0, Skipped: 0, Time elapsed: 1.765 sec
Running org.hisp.dhis.workbook.WorkbookServiceTest
Tests run: 3, Failures: 0, Errors: 0, Skipped: 0, Time elapsed: 3.718 sec
Running org.hisp.dhis.document.DocumentServiceTest
Tests run: 4, Failures: 0, Errors: 0, Skipped: 0, Time elapsed: 0.419 sec
Running org.hisp.dhis.reporttable.ReportTableServiceTest
Tests run: 12, Failures: 0, Errors: 0, Skipped: 0, Time elapsed: 3.346 sec
Running org.hisp.dhis.workbook.tallysheet.TallySheetServiceTest
Tests run: 2, Failures: 0, Errors: 0, Skipped: 0, Time elapsed: 0.347 sec
Running org.hisp.dhis.pdf.PdfServiceTest
Tests run: 3, Failures: 0, Errors: 0, Skipped: 0, Time elapsed: 1.2 sec
Running org.hisp.dhis.dashboard.DashboardStoreTest
Tests run: 4, Failures: 0, Errors: 0, Skipped: 0, Time elapsed: 0.399 sec
Running org.hisp.dhis.completeness.DataSetCompletenessServiceExportTest
Tests run: 1, Failures: 0, Errors: 0, Skipped: 0, Time elapsed: 0.308 sec

Results :

Tests run: 89, Failures: 0, Errors: 0, Skipped: 1

[HUDSON] Recording test results
[INFO] [jar:jar {execution: default-jar}]
[INFO] Building jar: <http://dhis.uio.no/ci/job/Dhis2%20Service%20Trunk/ws/dhis-2/dhis-services/dhis-service-reporting/target/dhis-service-reporting-2.0.6-SNAPSHOT.jar>
[INFO] [install:install {execution: default-install}]
[INFO] Installing <http://dhis.uio.no/ci/job/Dhis2%20Service%20Trunk/ws/dhis-2/dhis-services/dhis-service-reporting/target/dhis-service-reporting-2.0.6-SNAPSHOT.jar> to /ifi/utgard/p01/dhis/.m2/repository/org/hisp/dhis/dhis-service-reporting/2.0.6-SNAPSHOT/dhis-service-reporting-2.0.6-SNAPSHOT.jar
[INFO] Preparing findbugs:findbugs
[HUDSON] Archiving <http://dhis.uio.no/ci/job/Dhis2%20Service%20Trunk/ws/dhis-2/dhis-services/dhis-service-reporting/pom.xml> to /ifi/utgard/p01/dhis/projects/dhis-dev.ifi.uio.no/ci/home/jobs/Dhis2 Service Trunk/modules/org.hisp.dhis$dhis-service-reporting/builds/2010-12-23_19-01-43/archive/org.hisp.dhis/dhis-service-reporting/2.0.6-SNAPSHOT/pom.xml
[HUDSON] Archiving <http://dhis.uio.no/ci/job/Dhis2%20Service%20Trunk/ws/dhis-2/dhis-services/dhis-service-reporting/target/dhis-service-reporting-2.0.6-SNAPSHOT.jar> to /ifi/utgard/p01/dhis/projects/dhis-dev.ifi.uio.no/ci/home/jobs/Dhis2 Service Trunk/modules/org.hisp.dhis$dhis-service-reporting/builds/2010-12-23_19-01-43/archive/org.hisp.dhis/dhis-service-reporting/2.0.6-SNAPSHOT/dhis-service-reporting-2.0.6-SNAPSHOT.jar
[INFO] [resources:resources {execution: default-resources}]
[INFO] Using encoding: 'UTF-8' to copy filtered resources.
[INFO] [compiler:compile {execution: default-compile}]
[INFO] Nothing to compile - all classes are up to date
[INFO] [findbugs:findbugs {execution: default-cli}]
[INFO] Using source root:
[INFO] <http://dhis.uio.no/ci/job/Dhis2%20Service%20Trunk/ws/dhis-2/dhis-services/dhis-service-reporting/target/classes>
[INFO] Using test source root:
[INFO] <http://dhis.uio.no/ci/job/Dhis2%20Service%20Trunk/ws/dhis-2/dhis-services/dhis-service-reporting/target/test-classes>
[INFO] No effort provided, using default effort.
[INFO] Adding Source Directory: <http://dhis.uio.no/ci/job/Dhis2%20Service%20Trunk/ws/dhis-2/dhis-services/dhis-service-reporting/src/main/java>
[INFO] No threshold provided, using default threshold.
[INFO] Using FindBugs Version: 1.3.8
[INFO] No threshold provided, using default threshold.
[INFO] No threshold provided, using default threshold.
[INFO] No threshold provided, using default threshold.
[INFO] Using the xdoc format
[INFO] No effort provided, using default effort.
[INFO] No threshold provided, using default threshold.
[INFO] No threshold provided, using default threshold.
[INFO] Debugging is Off
[INFO] No bug include filter.
[INFO] Using bug exclude filter /tmp/plexus-resources1088139285tmp
[INFO] Printing Errors
[INFO] Printing Missing classes
[INFO] Printing Source Roots
[FINDBUGS] Successfully parsed file <http://dhis.uio.no/ci/job/Dhis2%20Service%20Trunk/ws/dhis-2/dhis-services/dhis-service-reporting/target/findbugsXml.xml> of module DHIS Reporting Service with 17 warnings.
[INFO] ------------------------------------------------------------------------
[INFO] Building DHIS Import-Export Service
[INFO] task-segment: [clean, install, findbugs:findbugs]
[INFO] ------------------------------------------------------------------------
[INFO] [clean:clean {execution: default-clean}]
[INFO] Deleting directory <http://dhis.uio.no/ci/job/Dhis2%20Service%20Trunk/ws/dhis-2/dhis-services/dhis-service-importexport/target>
[INFO] [resources:resources {execution: default-resources}]
[INFO] Using encoding: 'UTF-8' to copy filtered resources.
[INFO] [compiler:compile {execution: default-compile}]
[INFO] Compiling 223 source files to <http://dhis.uio.no/ci/job/Dhis2%20Service%20Trunk/ws/dhis-2/dhis-services/dhis-service-importexport/target/classes>
[HUDSON] Archiving <http://dhis.uio.no/ci/job/Dhis2%20Service%20Trunk/ws/dhis-2/dhis-services/dhis-service-importexport/pom.xml> to /ifi/utgard/p01/dhis/projects/dhis-dev.ifi.uio.no/ci/home/jobs/Dhis2 Service Trunk/modules/org.hisp.dhis$dhis-service-importexport/builds/2010-12-23_19-01-43/archive/org.hisp.dhis/dhis-service-importexport/2.0.6-SNAPSHOT/pom.xml
[INFO] ------------------------------------------------------------------------
[ERROR] BUILD FAILURE
[INFO] ------------------------------------------------------------------------
[INFO] Compilation failure

<http://dhis.uio.no/ci/job/Dhis2%20Service%20Trunk/ws/dhis-2/dhis-services/dhis-service-importexport/src/main/java/org/hisp/dhis/importexport/dxf/converter/DXFConverter.java>:[94,38] cannot find symbol
symbol : class DataEntryFormBatchHandler
location: package org.hisp.dhis.jdbc.batchhandler

<http://dhis.uio.no/ci/job/Dhis2%20Service%20Trunk/ws/dhis-2/dhis-services/dhis-service-importexport/src/main/java/org/hisp/dhis/importexport/dxf/exporter/DefaultDXFExportService.java>:[80,47] cannot find symbol
symbol : class DataEntryFormConverter
location: package org.hisp.dhis.importexport.dxf.converter

<http://dhis.uio.no/ci/job/Dhis2%20Service%20Trunk/ws/dhis-2/dhis-services/dhis-service-importexport/src/main/java/org/hisp/dhis/importexport/service/DefaultImportObjectManager.java>:[83,42] cannot find symbol
symbol : class DataEntryFormImporter
location: package org.hisp.dhis.importexport.importer

<http://dhis.uio.no/ci/job/Dhis2%20Service%20Trunk/ws/dhis-2/dhis-services/dhis-service-importexport/src/main/java/org/hisp/dhis/importexport/mapping/DefaultObjectMappingGenerator.java>:[59,38] cannot find symbol
symbol : class DataEntryFormBatchHandler
location: package org.hisp.dhis.jdbc.batchhandler

<http://dhis.uio.no/ci/job/Dhis2%20Service%20Trunk/ws/dhis-2/dhis-services/dhis-service-importexport/src/main/java/org/hisp/dhis/importexport/dxf/converter/DXFConverter.java>:[730,45] cannot find symbol
symbol : variable DataEntryFormConverter
location: class org.hisp.dhis.importexport.dxf.converter.DXFConverter

<http://dhis.uio.no/ci/job/Dhis2%20Service%20Trunk/ws/dhis-2/dhis-services/dhis-service-importexport/src/main/java/org/hisp/dhis/importexport/dxf/converter/DXFConverter.java>:[735,20] cannot find symbol
symbol : class DataEntryFormBatchHandler
location: class org.hisp.dhis.importexport.dxf.converter.DXFConverter

<http://dhis.uio.no/ci/job/Dhis2%20Service%20Trunk/ws/dhis-2/dhis-services/dhis-service-importexport/src/main/java/org/hisp/dhis/importexport/dxf/converter/DXFConverter.java>:[737,45] cannot find symbol
symbol : class DataEntryFormConverter
location: class org.hisp.dhis.importexport.dxf.converter.DXFConverter

<http://dhis.uio.no/ci/job/Dhis2%20Service%20Trunk/ws/dhis-2/dhis-services/dhis-service-importexport/src/main/java/org/hisp/dhis/importexport/dxf/exporter/DefaultDXFExportService.java>:[331,45] cannot find symbol
symbol : class DataEntryFormConverter
location: class org.hisp.dhis.importexport.dxf.exporter.DefaultDXFExportService

<http://dhis.uio.no/ci/job/Dhis2%20Service%20Trunk/ws/dhis-2/dhis-services/dhis-service-importexport/src/main/java/org/hisp/dhis/importexport/service/DefaultImportObjectManager.java>:[1154,47] cannot find symbol
symbol : class DataEntryFormImporter
location: class org.hisp.dhis.importexport.service.DefaultImportObjectManager

<http://dhis.uio.no/ci/job/Dhis2%20Service%20Trunk/ws/dhis-2/dhis-services/dhis-service-importexport/src/main/java/org/hisp/dhis/importexport/mapping/DefaultObjectMappingGenerator.java>:[270,91] cannot find symbol
symbol : class DataEntryFormBatchHandler
location: class org.hisp.dhis.importexport.mapping.DefaultObjectMappingGenerator

[INFO] ------------------------------------------------------------------------
[INFO] For more information, run Maven with the -e switch
[INFO] ------------------------------------------------------------------------
[INFO] Total time: 11 minutes 42 seconds
[INFO] Finished at: Thu Dec 23 19:13:32 CET 2010
[INFO] Final Memory: 194M/463M
[INFO] ------------------------------------------------------------------------
Sending e-mails to: dhis2-devs@lists.launchpad.net
channel stopped

See <http://dhis.uio.no/ci/job/Dhis2%20Service%20Trunk/1777/changes>

Changes:

[Jan Henrik Overland] (GIS) Simple user access control implemented.

···

------------------------------------------
[...truncated 1065 lines...]
[INFO] <http://dhis.uio.no/ci/job/Dhis2%20Service%20Trunk/ws/dhis-2/dhis-services/dhis-service-aggregationengine-default/target/test-classes>
[INFO] No effort provided, using default effort.
[INFO] Adding Source Directory: <http://dhis.uio.no/ci/job/Dhis2%20Service%20Trunk/ws/dhis-2/dhis-services/dhis-service-aggregationengine-default/src/main/java>
[INFO] No threshold provided, using default threshold.
[INFO] Using FindBugs Version: 1.3.8
[INFO] No threshold provided, using default threshold.
[INFO] No threshold provided, using default threshold.
[INFO] No threshold provided, using default threshold.
[INFO] Using the xdoc format
[INFO] No effort provided, using default effort.
[INFO] No threshold provided, using default threshold.
[INFO] No threshold provided, using default threshold.
[INFO] Debugging is Off
[INFO] No bug include filter.
[INFO] Using bug exclude filter /tmp/plexus-resources1245570548tmp
[INFO] Printing Errors
[INFO] Printing Missing classes
[INFO] Printing Source Roots
[FINDBUGS] Successfully parsed file <http://dhis.uio.no/ci/job/Dhis2%20Service%20Trunk/ws/dhis-2/dhis-services/dhis-service-aggregationengine-default/target/findbugsXml.xml> of module DHIS Aggregation Service - Default with 10 warnings.
[INFO] ------------------------------------------------------------------------
[INFO] Building DHIS OrganisationUnit API Implementations
[INFO] task-segment: [clean, install, findbugs:findbugs]
[INFO] ------------------------------------------------------------------------
[INFO] [clean:clean {execution: default-clean}]
[INFO] Deleting directory <http://dhis.uio.no/ci/job/Dhis2%20Service%20Trunk/ws/dhis-2/dhis-services/dhis-service-mapping/target>
[INFO] [resources:resources {execution: default-resources}]
[INFO] Using encoding: 'UTF-8' to copy filtered resources.
[INFO] [compiler:compile {execution: default-compile}]
[INFO] Compiling 4 source files to <http://dhis.uio.no/ci/job/Dhis2%20Service%20Trunk/ws/dhis-2/dhis-services/dhis-service-mapping/target/classes>
[INFO] [resources:testResources {execution: default-testResources}]
[INFO] Using encoding: 'UTF-8' to copy filtered resources.
[INFO] [compiler:testCompile {execution: default-testCompile}]
[INFO] Compiling 2 source files to <http://dhis.uio.no/ci/job/Dhis2%20Service%20Trunk/ws/dhis-2/dhis-services/dhis-service-mapping/target/test-classes>
[INFO] [surefire:test {execution: default-test}]
[INFO] Surefire report directory: <http://dhis.uio.no/ci/job/Dhis2%20Service%20Trunk/ws/dhis-2/dhis-services/dhis-service-mapping/target/surefire-reports>

-------------------------------------------------------
T E S T S
-------------------------------------------------------
Running org.hisp.dhis.mapping.MappingServiceTest
Tests run: 2, Failures: 0, Errors: 0, Skipped: 0, Time elapsed: 29.733 sec
Running org.hisp.dhis.mapping.MappingStoreTest
Tests run: 1, Failures: 0, Errors: 0, Skipped: 0, Time elapsed: 0.633 sec

Results :

Tests run: 3, Failures: 0, Errors: 0, Skipped: 0

[HUDSON] Recording test results
[INFO] [jar:jar {execution: default-jar}]
[INFO] Building jar: <http://dhis.uio.no/ci/job/Dhis2%20Service%20Trunk/ws/dhis-2/dhis-services/dhis-service-mapping/target/dhis-service-mapping-2.0.6-SNAPSHOT.jar>
[INFO] [install:install {execution: default-install}]
[INFO] Installing <http://dhis.uio.no/ci/job/Dhis2%20Service%20Trunk/ws/dhis-2/dhis-services/dhis-service-mapping/target/dhis-service-mapping-2.0.6-SNAPSHOT.jar> to /ifi/utgard/p01/dhis/.m2/repository/org/hisp/dhis/dhis-service-mapping/2.0.6-SNAPSHOT/dhis-service-mapping-2.0.6-SNAPSHOT.jar
[INFO] Preparing findbugs:findbugs
[HUDSON] Archiving <http://dhis.uio.no/ci/job/Dhis2%20Service%20Trunk/ws/dhis-2/dhis-services/dhis-service-mapping/pom.xml> to /ifi/utgard/p01/dhis/projects/dhis-dev.ifi.uio.no/ci/home/jobs/Dhis2 Service Trunk/modules/org.hisp.dhis$dhis-service-mapping/builds/2010-12-24_17-01-51/archive/org.hisp.dhis/dhis-service-mapping/2.0.6-SNAPSHOT/pom.xml
[HUDSON] Archiving <http://dhis.uio.no/ci/job/Dhis2%20Service%20Trunk/ws/dhis-2/dhis-services/dhis-service-mapping/target/dhis-service-mapping-2.0.6-SNAPSHOT.jar> to /ifi/utgard/p01/dhis/projects/dhis-dev.ifi.uio.no/ci/home/jobs/Dhis2 Service Trunk/modules/org.hisp.dhis$dhis-service-mapping/builds/2010-12-24_17-01-51/archive/org.hisp.dhis/dhis-service-mapping/2.0.6-SNAPSHOT/dhis-service-mapping-2.0.6-SNAPSHOT.jar
[INFO] [resources:resources {execution: default-resources}]
[INFO] Using encoding: 'UTF-8' to copy filtered resources.
[INFO] [compiler:compile {execution: default-compile}]
[INFO] Nothing to compile - all classes are up to date
[INFO] [findbugs:findbugs {execution: default-cli}]
[INFO] Using source root:
[INFO] <http://dhis.uio.no/ci/job/Dhis2%20Service%20Trunk/ws/dhis-2/dhis-services/dhis-service-mapping/target/classes>
[INFO] Using test source root:
[INFO] <http://dhis.uio.no/ci/job/Dhis2%20Service%20Trunk/ws/dhis-2/dhis-services/dhis-service-mapping/target/test-classes>
[INFO] No effort provided, using default effort.
[INFO] Adding Source Directory: <http://dhis.uio.no/ci/job/Dhis2%20Service%20Trunk/ws/dhis-2/dhis-services/dhis-service-mapping/src/main/java>
[INFO] No threshold provided, using default threshold.
[INFO] Using FindBugs Version: 1.3.8
[INFO] No threshold provided, using default threshold.
[INFO] No threshold provided, using default threshold.
[INFO] No threshold provided, using default threshold.
[INFO] Using the xdoc format
[INFO] No effort provided, using default effort.
[INFO] No threshold provided, using default threshold.
[INFO] No threshold provided, using default threshold.
[INFO] Debugging is Off
[INFO] No bug include filter.
[INFO] Using bug exclude filter /tmp/plexus-resources1374327988tmp
[INFO] Printing Errors
[INFO] Printing Missing classes
[INFO] Printing Source Roots
[FINDBUGS] Successfully parsed file <http://dhis.uio.no/ci/job/Dhis2%20Service%20Trunk/ws/dhis-2/dhis-services/dhis-service-mapping/target/findbugsXml.xml> of module DHIS OrganisationUnit API Implementations with 0 warnings.
[INFO] ------------------------------------------------------------------------
[INFO] Building DHIS Reporting Service
[INFO] task-segment: [clean, install, findbugs:findbugs]
[INFO] ------------------------------------------------------------------------
[INFO] [clean:clean {execution: default-clean}]
[INFO] Deleting directory <http://dhis.uio.no/ci/job/Dhis2%20Service%20Trunk/ws/dhis-2/dhis-services/dhis-service-reporting/target>
[INFO] [resources:resources {execution: default-resources}]
[INFO] Using encoding: 'UTF-8' to copy filtered resources.
[INFO] [compiler:compile {execution: default-compile}]
[INFO] Compiling 38 source files to <http://dhis.uio.no/ci/job/Dhis2%20Service%20Trunk/ws/dhis-2/dhis-services/dhis-service-reporting/target/classes>
[INFO] [resources:testResources {execution: default-testResources}]
[INFO] Using encoding: 'UTF-8' to copy filtered resources.
[INFO] [compiler:testCompile {execution: default-testCompile}]
[INFO] Compiling 21 source files to <http://dhis.uio.no/ci/job/Dhis2%20Service%20Trunk/ws/dhis-2/dhis-services/dhis-service-reporting/target/test-classes>
[INFO] [surefire:test {execution: default-test}]
[INFO] Surefire report directory: <http://dhis.uio.no/ci/job/Dhis2%20Service%20Trunk/ws/dhis-2/dhis-services/dhis-service-reporting/target/surefire-reports>

-------------------------------------------------------
T E S T S
-------------------------------------------------------
Running org.hisp.dhis.reporttable.ReportTableStoreTest
Tests run: 4, Failures: 0, Errors: 0, Skipped: 0, Time elapsed: 39.054 sec
Running org.hisp.dhis.report.ReportManagerTest
Tests run: 1, Failures: 0, Errors: 0, Skipped: 0, Time elapsed: 1.232 sec
Running org.hisp.dhis.completeness.DataSetCompletenessServiceTest
Tests run: 9, Failures: 0, Errors: 0, Skipped: 1, Time elapsed: 4.44 sec
Running org.hisp.dhis.reporttable.ReportTableStatementTest
Tests run: 6, Failures: 0, Errors: 0, Skipped: 0, Time elapsed: 1.112 sec
Running org.hisp.dhis.reporttable.ReportTableTest
Tests run: 12, Failures: 0, Errors: 0, Skipped: 0, Time elapsed: 0.83 sec
Running org.hisp.dhis.report.ReportStoreTest
Tests run: 4, Failures: 0, Errors: 0, Skipped: 0, Time elapsed: 0.294 sec
Running org.hisp.dhis.orgunitdistribution.OrgUnitDistributionServiceTest
Tests run: 1, Failures: 0, Errors: 0, Skipped: 0, Time elapsed: 0.086 sec
Running org.hisp.dhis.olap.OlapURLStoreTest
Tests run: 3, Failures: 0, Errors: 0, Skipped: 0, Time elapsed: 0.177 sec
Running org.hisp.dhis.olap.OlapURLServiceTest
Tests run: 1, Failures: 0, Errors: 0, Skipped: 0, Time elapsed: 0.092 sec
Running org.hisp.dhis.reporttable.ReportTableManagerTest
Tests run: 6, Failures: 0, Errors: 0, Skipped: 0, Time elapsed: 0.624 sec
Running org.hisp.dhis.chart.ChartStoreTest
Tests run: 4, Failures: 0, Errors: 0, Skipped: 0, Time elapsed: 0.623 sec
Running org.hisp.dhis.document.DocumentStoreTest
Tests run: 4, Failures: 0, Errors: 0, Skipped: 0, Time elapsed: 0.234 sec
Running org.hisp.dhis.chart.ChartServiceTest
Tests run: 5, Failures: 0, Errors: 0, Skipped: 0, Time elapsed: 2.081 sec
Running org.hisp.dhis.workbook.WorkbookServiceTest
Tests run: 3, Failures: 0, Errors: 0, Skipped: 0, Time elapsed: 3.885 sec
Running org.hisp.dhis.document.DocumentServiceTest
Tests run: 4, Failures: 0, Errors: 0, Skipped: 0, Time elapsed: 0.287 sec
Running org.hisp.dhis.reporttable.ReportTableServiceTest
Tests run: 12, Failures: 0, Errors: 0, Skipped: 0, Time elapsed: 3.395 sec
Running org.hisp.dhis.workbook.tallysheet.TallySheetServiceTest
Tests run: 2, Failures: 0, Errors: 0, Skipped: 0, Time elapsed: 0.388 sec
Running org.hisp.dhis.pdf.PdfServiceTest
Tests run: 3, Failures: 0, Errors: 0, Skipped: 0, Time elapsed: 1.495 sec
Running org.hisp.dhis.dashboard.DashboardStoreTest
Tests run: 4, Failures: 0, Errors: 0, Skipped: 0, Time elapsed: 0.307 sec
Running org.hisp.dhis.completeness.DataSetCompletenessServiceExportTest
Tests run: 1, Failures: 0, Errors: 0, Skipped: 0, Time elapsed: 0.326 sec

Results :

Tests run: 89, Failures: 0, Errors: 0, Skipped: 1

[HUDSON] Recording test results
[INFO] [jar:jar {execution: default-jar}]
[INFO] Building jar: <http://dhis.uio.no/ci/job/Dhis2%20Service%20Trunk/ws/dhis-2/dhis-services/dhis-service-reporting/target/dhis-service-reporting-2.0.6-SNAPSHOT.jar>
[INFO] [install:install {execution: default-install}]
[INFO] Installing <http://dhis.uio.no/ci/job/Dhis2%20Service%20Trunk/ws/dhis-2/dhis-services/dhis-service-reporting/target/dhis-service-reporting-2.0.6-SNAPSHOT.jar> to /ifi/utgard/p01/dhis/.m2/repository/org/hisp/dhis/dhis-service-reporting/2.0.6-SNAPSHOT/dhis-service-reporting-2.0.6-SNAPSHOT.jar
[INFO] Preparing findbugs:findbugs
[HUDSON] Archiving <http://dhis.uio.no/ci/job/Dhis2%20Service%20Trunk/ws/dhis-2/dhis-services/dhis-service-reporting/pom.xml> to /ifi/utgard/p01/dhis/projects/dhis-dev.ifi.uio.no/ci/home/jobs/Dhis2 Service Trunk/modules/org.hisp.dhis$dhis-service-reporting/builds/2010-12-24_17-01-51/archive/org.hisp.dhis/dhis-service-reporting/2.0.6-SNAPSHOT/pom.xml
[HUDSON] Archiving <http://dhis.uio.no/ci/job/Dhis2%20Service%20Trunk/ws/dhis-2/dhis-services/dhis-service-reporting/target/dhis-service-reporting-2.0.6-SNAPSHOT.jar> to /ifi/utgard/p01/dhis/projects/dhis-dev.ifi.uio.no/ci/home/jobs/Dhis2 Service Trunk/modules/org.hisp.dhis$dhis-service-reporting/builds/2010-12-24_17-01-51/archive/org.hisp.dhis/dhis-service-reporting/2.0.6-SNAPSHOT/dhis-service-reporting-2.0.6-SNAPSHOT.jar
[INFO] [resources:resources {execution: default-resources}]
[INFO] Using encoding: 'UTF-8' to copy filtered resources.
[INFO] [compiler:compile {execution: default-compile}]
[INFO] Nothing to compile - all classes are up to date
[INFO] [findbugs:findbugs {execution: default-cli}]
[INFO] Using source root:
[INFO] <http://dhis.uio.no/ci/job/Dhis2%20Service%20Trunk/ws/dhis-2/dhis-services/dhis-service-reporting/target/classes>
[INFO] Using test source root:
[INFO] <http://dhis.uio.no/ci/job/Dhis2%20Service%20Trunk/ws/dhis-2/dhis-services/dhis-service-reporting/target/test-classes>
[INFO] No effort provided, using default effort.
[INFO] Adding Source Directory: <http://dhis.uio.no/ci/job/Dhis2%20Service%20Trunk/ws/dhis-2/dhis-services/dhis-service-reporting/src/main/java>
[INFO] No threshold provided, using default threshold.
[INFO] Using FindBugs Version: 1.3.8
[INFO] No threshold provided, using default threshold.
[INFO] No threshold provided, using default threshold.
[INFO] No threshold provided, using default threshold.
[INFO] Using the xdoc format
[INFO] No effort provided, using default effort.
[INFO] No threshold provided, using default threshold.
[INFO] No threshold provided, using default threshold.
[INFO] Debugging is Off
[INFO] No bug include filter.
[INFO] Using bug exclude filter /tmp/plexus-resources2009965684tmp
[INFO] Printing Errors
[INFO] Printing Missing classes
[INFO] Printing Source Roots
[FINDBUGS] Successfully parsed file <http://dhis.uio.no/ci/job/Dhis2%20Service%20Trunk/ws/dhis-2/dhis-services/dhis-service-reporting/target/findbugsXml.xml> of module DHIS Reporting Service with 17 warnings.
[INFO] ------------------------------------------------------------------------
[INFO] Building DHIS Import-Export Service
[INFO] task-segment: [clean, install, findbugs:findbugs]
[INFO] ------------------------------------------------------------------------
[INFO] [clean:clean {execution: default-clean}]
[INFO] Deleting directory <http://dhis.uio.no/ci/job/Dhis2%20Service%20Trunk/ws/dhis-2/dhis-services/dhis-service-importexport/target>
[INFO] [resources:resources {execution: default-resources}]
[INFO] Using encoding: 'UTF-8' to copy filtered resources.
[INFO] [compiler:compile {execution: default-compile}]
[INFO] Compiling 223 source files to <http://dhis.uio.no/ci/job/Dhis2%20Service%20Trunk/ws/dhis-2/dhis-services/dhis-service-importexport/target/classes>
[HUDSON] Archiving <http://dhis.uio.no/ci/job/Dhis2%20Service%20Trunk/ws/dhis-2/dhis-services/dhis-service-importexport/pom.xml> to /ifi/utgard/p01/dhis/projects/dhis-dev.ifi.uio.no/ci/home/jobs/Dhis2 Service Trunk/modules/org.hisp.dhis$dhis-service-importexport/builds/2010-12-24_17-01-51/archive/org.hisp.dhis/dhis-service-importexport/2.0.6-SNAPSHOT/pom.xml
[INFO] ------------------------------------------------------------------------
[ERROR] BUILD FAILURE
[INFO] ------------------------------------------------------------------------
[INFO] Compilation failure

<http://dhis.uio.no/ci/job/Dhis2%20Service%20Trunk/ws/dhis-2/dhis-services/dhis-service-importexport/src/main/java/org/hisp/dhis/importexport/dxf/converter/DXFConverter.java>:[94,38] cannot find symbol
symbol : class DataEntryFormBatchHandler
location: package org.hisp.dhis.jdbc.batchhandler

<http://dhis.uio.no/ci/job/Dhis2%20Service%20Trunk/ws/dhis-2/dhis-services/dhis-service-importexport/src/main/java/org/hisp/dhis/importexport/dxf/exporter/DefaultDXFExportService.java>:[80,47] cannot find symbol
symbol : class DataEntryFormConverter
location: package org.hisp.dhis.importexport.dxf.converter

<http://dhis.uio.no/ci/job/Dhis2%20Service%20Trunk/ws/dhis-2/dhis-services/dhis-service-importexport/src/main/java/org/hisp/dhis/importexport/service/DefaultImportObjectManager.java>:[83,42] cannot find symbol
symbol : class DataEntryFormImporter
location: package org.hisp.dhis.importexport.importer

<http://dhis.uio.no/ci/job/Dhis2%20Service%20Trunk/ws/dhis-2/dhis-services/dhis-service-importexport/src/main/java/org/hisp/dhis/importexport/mapping/DefaultObjectMappingGenerator.java>:[59,38] cannot find symbol
symbol : class DataEntryFormBatchHandler
location: package org.hisp.dhis.jdbc.batchhandler

<http://dhis.uio.no/ci/job/Dhis2%20Service%20Trunk/ws/dhis-2/dhis-services/dhis-service-importexport/src/main/java/org/hisp/dhis/importexport/dxf/converter/DXFConverter.java>:[730,45] cannot find symbol
symbol : variable DataEntryFormConverter
location: class org.hisp.dhis.importexport.dxf.converter.DXFConverter

<http://dhis.uio.no/ci/job/Dhis2%20Service%20Trunk/ws/dhis-2/dhis-services/dhis-service-importexport/src/main/java/org/hisp/dhis/importexport/dxf/converter/DXFConverter.java>:[735,20] cannot find symbol
symbol : class DataEntryFormBatchHandler
location: class org.hisp.dhis.importexport.dxf.converter.DXFConverter

<http://dhis.uio.no/ci/job/Dhis2%20Service%20Trunk/ws/dhis-2/dhis-services/dhis-service-importexport/src/main/java/org/hisp/dhis/importexport/dxf/converter/DXFConverter.java>:[737,45] cannot find symbol
symbol : class DataEntryFormConverter
location: class org.hisp.dhis.importexport.dxf.converter.DXFConverter

<http://dhis.uio.no/ci/job/Dhis2%20Service%20Trunk/ws/dhis-2/dhis-services/dhis-service-importexport/src/main/java/org/hisp/dhis/importexport/dxf/exporter/DefaultDXFExportService.java>:[331,45] cannot find symbol
symbol : class DataEntryFormConverter
location: class org.hisp.dhis.importexport.dxf.exporter.DefaultDXFExportService

<http://dhis.uio.no/ci/job/Dhis2%20Service%20Trunk/ws/dhis-2/dhis-services/dhis-service-importexport/src/main/java/org/hisp/dhis/importexport/service/DefaultImportObjectManager.java>:[1154,47] cannot find symbol
symbol : class DataEntryFormImporter
location: class org.hisp.dhis.importexport.service.DefaultImportObjectManager

<http://dhis.uio.no/ci/job/Dhis2%20Service%20Trunk/ws/dhis-2/dhis-services/dhis-service-importexport/src/main/java/org/hisp/dhis/importexport/mapping/DefaultObjectMappingGenerator.java>:[270,91] cannot find symbol
symbol : class DataEntryFormBatchHandler
location: class org.hisp.dhis.importexport.mapping.DefaultObjectMappingGenerator

[INFO] ------------------------------------------------------------------------
[INFO] For more information, run Maven with the -e switch
[INFO] ------------------------------------------------------------------------
[INFO] Total time: 12 minutes 38 seconds
[INFO] Finished at: Fri Dec 24 17:14:38 CET 2010
[INFO] Final Memory: 193M/460M
[INFO] ------------------------------------------------------------------------
Sending e-mails to: dhis2-devs@lists.launchpad.net
channel stopped

See <http://dhis.uio.no/ci/job/Dhis2%20Service%20Trunk/1778/changes>