Code build error 2.18

Hello,

can anyone help me solve this error,

I wm building dhis2 2.18 code ,

I m running this command : I m using mvn clean -Dmaven.test.skip=true install

[INFO] BUILD FAILURE

[INFO] ------------------------------------------------------------------------

[INFO] Total time: 03:35 min

[INFO] Finished at: 2015-03-04T09:36:13+02:00

[INFO] Final Memory: 43M/103M

[INFO] ------------------------------------------------------------------------

[ERROR] Failed to execute goal on project dhis-support-test: Could not resolve dependencies for project org.hisp.dhis:dhis-support-test:jar:2.18: Failed to collect dependencies at org.amplecode:quick:jar:1.11: Failed to read artifact descriptor for org.amplecode:quick:jar:1.11: Could not transfer artifact org.amplecode:quick:pom:1.11 from/to amplecode_maven2_repo (http://maven.dhis2.org/amplecode-local): Connect to maven.dhis2.org:80 [maven.dhis2.org/178.79.143.102] failed: Connection timed out -> [Help 1]

[ERROR]

[ERROR] To see the full stack trace of the errors, re-run Maven with the -e switch.

[ERROR] Re-run Maven using the -X switch to enable full debug logging.

[ERROR]

[ERROR] For more information about the errors and possible solutions, please read the following articles:

[ERROR] [Help 1] http://cwiki.apache.org/confluence/display/MAVEN/DependencyResolutionException

[ERROR]

[ERROR] After correcting the problems, you can resume the build with the command

[ERROR] mvn -rf :dhis-support-test

regards

···

-----

JEAN PAUL MUTALI

Tel: +250 78-862-8000, +1 845-584-1789

Kicukiro, Av 21, P.O.Box 371 Kigali - RWANDA

Skype: mutali.rw

Hi

Seems like its down at the moment… I’m including the file you need, put it in:

.m2/repository/org/amplecode/quick

quick 1.11.zip (34.7 KB)

···

On Wed, Mar 4, 2015 at 3:59 PM, J. Paul Mutali mutali@gmail.com wrote:

Hello,

can anyone help me solve this error,

I wm building dhis2 2.18 code ,

I m running this command : I m using mvn clean -Dmaven.test.skip=true install

[INFO] BUILD FAILURE

[INFO] ------------------------------------------------------------------------

[INFO] Total time: 03:35 min

[INFO] Finished at: 2015-03-04T09:36:13+02:00

[INFO] Final Memory: 43M/103M

[INFO] ------------------------------------------------------------------------

[ERROR] Failed to execute goal on project dhis-support-test: Could not resolve dependencies for project org.hisp.dhis:dhis-support-test:jar:2.18: Failed to collect dependencies at org.amplecode:quick:jar:1.11: Failed to read artifact descriptor for org.amplecode:quick:jar:1.11: Could not transfer artifact org.amplecode:quick:pom:1.11 from/to amplecode_maven2_repo (http://maven.dhis2.org/amplecode-local): Connect to maven.dhis2.org:80 [maven.dhis2.org/178.79.143.102] failed: Connection timed out -> [Help 1]

[ERROR]

[ERROR] To see the full stack trace of the errors, re-run Maven with the -e switch.

[ERROR] Re-run Maven using the -X switch to enable full debug logging.

[ERROR]

[ERROR] For more information about the errors and possible solutions, please read the following articles:

[ERROR] [Help 1] http://cwiki.apache.org/confluence/display/MAVEN/DependencyResolutionException

[ERROR]

[ERROR] After correcting the problems, you can resume the build with the command

[ERROR] mvn -rf :dhis-support-test

regards


-----

JEAN PAUL MUTALI

Tel: +250 78-862-8000, +1 845-584-1789

Kicukiro, Av 21, P.O.Box 371 Kigali - RWANDA

Skype: mutali.rw


Mailing list: https://launchpad.net/~dhis2-devs

Post to : dhis2-devs@lists.launchpad.net

Unsubscribe : https://launchpad.net/~dhis2-devs

More help : https://help.launchpad.net/ListHelp


Morten

Hi Paul,

this is now fixed.

We have moved some libraries to maven central and gotten out of the maven
repository business.

regards,

Lars

Thanks,

It is working well now.

Paul

···

On Wed, Mar 4, 2015 at 11:52 PM, Lars Helge Øverland larshelge@gmail.com wrote:

Hi Paul,

this is now fixed.

We have moved some libraries to maven central and gotten out of the maven repository business.

regards,

Lars