Building issue in 2.35.3-SNAPSHOT

Dear Team,

While i am build the source code of version 2.35.3-SNAPSHOT i found issue related to
org.hisp.dhis.rules
rule-engine
2.0.14

[INFO] Scanning for projects…
[INFO]
[INFO] -----------------------< org.hisp.dhis:dhis-api >-----------------------
[INFO] Building DHIS API 2.35.3-SNAPSHOT
[INFO] --------------------------------[ jar ]---------------------------------
Downloading from ossrh: https://oss.sonatype.org/content/repositories/snapshots/org/hisp/dhis/rules/rule-engine/2.35.3-SNAPSHOT/maven-metadata.xml
Downloading from jitpack.io: https://jitpack.io/org/hisp/dhis/rules/rule-engine/2.35.3-SNAPSHOT/maven-metadata.xml
Downloading from ossrh: https://oss.sonatype.org/content/repositories/snapshots/org/hisp/dhis/rules/rule-engine/2.35.3-SNAPSHOT/rule-engine-2.35.3-SNAPSHOT.pom
Downloading from jitpack.io: https://jitpack.io/org/hisp/dhis/rules/rule-engine/2.35.3-SNAPSHOT/rule-engine-2.35.3-SNAPSHOT.pom
[WARNING] The POM for org.hisp.dhis.rules:rule-engine:jar:2.35.3-SNAPSHOT is missing, no dependency information available
Downloading from ossrh: https://oss.sonatype.org/content/repositories/snapshots/org/hisp/dhis/rules/rule-engine/2.35.3-SNAPSHOT/rule-engine-2.35.3-SNAPSHOT.jar
Downloading from jitpack.io: https://jitpack.io/org/hisp/dhis/rules/rule-engine/2.35.3-SNAPSHOT/rule-engine-2.35.3-SNAPSHOT.jar
[INFO] ------------------------------------------------------------------------
[INFO] BUILD FAILURE
[INFO] ------------------------------------------------------------------------
[INFO] Total time: 8.583 s
[INFO] Finished at: 2021-03-17T09:40:19+05:30
[INFO] ------------------------------------------------------------------------
[ERROR] Failed to execute goal on project dhis-api: Could not resolve dependencies for project org.hisp.dhis:dhis-api:jar:2.35.3-SNAPSHOT: Could not find artifact org.hisp.dhis.rules:rule-engine:jar:2.35.3-SNAPSHOT in ossrh (https://oss.sonatype.org/content/repositories/snapshots) → [Help 1]
[ERROR]
[ERROR] To see the full stack trace of the errors, re-run Maven with the -e switch.
[ERROR] Re-run Maven using the -X switch to enable full debug logging.
[ERROR]
[ERROR] For more information about the errors and possible solutions, please read the following articles:
[ERROR] [Help 1] http://cwiki.apache.org/confluence/display/MAVEN/DependencyResolutionException
Java HotSpot™ 64-Bit Server VM warning: ignoring option MaxPermSize=512m; support was removed in 8.0

please help to resolved the issue so that i can able to build the source code

Thanks and Regards

Mithilesh Kumar Thakur