Build failed in Jenkins: Dhis2 Web Trunk » DHIS Data Dictionary #2687

See <DHIS2 App Hub;

Changes:

[Tran Chau] Fix bug: Filter indicator by dictionary.

···

------------------------------------------
[INFO] ------------------------------------------------------------------------
[INFO] Building DHIS Data Dictionary
[INFO] task-segment: [clean, install, findbugs:findbugs]
[INFO] ------------------------------------------------------------------------
[INFO] [clean:clean {execution: default-clean}]
[INFO] Deleting directory <DHIS2 App Hub;
[INFO] [resources:resources {execution: default-resources}]
[INFO] Using encoding: 'UTF-8' to copy filtered resources.
[INFO] snapshot org.hisp.dhis:dhis-service-importexport:2.3-SNAPSHOT: checking for updates from amplecode_maven2_repo
[INFO] snapshot org.hisp.dhis:dhis-service-importexport:2.3-SNAPSHOT: checking for updates from dhis.uio.no
[INFO] [compiler:compile {execution: default-compile}]
[INFO] Compiling 96 source files to <DHIS2 App Hub;
[INFO] -------------------------------------------------------------
[ERROR] COMPILATION ERROR :
[INFO] -------------------------------------------------------------
[ERROR] <DHIS2 App Hub getDataElementsByDictionaryId(int) in org.hisp.dhis.datadictionary.DataDictionaryService cannot be applied to (java.lang.String,java.lang.Integer)
[ERROR] <DHIS2 App Hub cannot find symbol
symbol : method getIndicatorsByDictionaryId(java.lang.String,java.lang.Integer)
location: interface org.hisp.dhis.datadictionary.DataDictionaryService
[ERROR] <DHIS2 App Hub cannot find symbol
symbol : method getIndicatorsByDictionaryId(java.lang.Integer)
location: interface org.hisp.dhis.datadictionary.DataDictionaryService
[INFO] 3 errors
[INFO] -------------------------------------------------------------
[JENKINS] Archiving <DHIS2 App Hub; to /projects/hisp/jenkins_home/jobs/Dhis2 Web Trunk/modules/org.hisp.dhis$dhis-web-maintenance-datadictionary/builds/2011-06-02_05-37-22/archive/org.hisp.dhis/dhis-web-maintenance-datadictionary/2.3-SNAPSHOT/dhis-web-maintenance-datadictionary-2.3-SNAPSHOT.pom
[INFO] ------------------------------------------------------------------------
[ERROR] BUILD FAILURE
[INFO] ------------------------------------------------------------------------
[INFO] Compilation failure

<DHIS2 App Hub getDataElementsByDictionaryId(int) in org.hisp.dhis.datadictionary.DataDictionaryService cannot be applied to (java.lang.String,java.lang.Integer)
<DHIS2 App Hub cannot find symbol
symbol : method getIndicatorsByDictionaryId(java.lang.String,java.lang.Integer)
location: interface org.hisp.dhis.datadictionary.DataDictionaryService
<DHIS2 App Hub cannot find symbol
symbol : method getIndicatorsByDictionaryId(java.lang.Integer)
location: interface org.hisp.dhis.datadictionary.DataDictionaryService

[INFO] ------------------------------------------------------------------------
[INFO] For more information, run Maven with the -e switch
[INFO] ------------------------------------------------------------------------
[INFO] Total time: 6 minutes 13 seconds
[INFO] Finished at: Thu Jun 02 05:43:43 CEST 2011
[INFO] Final Memory: 86M/227M
[INFO] ------------------------------------------------------------------------
Waiting for Jenkins to finish collecting data

See <DHIS2 App Hub;