Build failed in Jenkins: Dhis2 Web Trunk #2714

See <DHIS2 App Hub;

Changes:

[Lars Helge Overland] Changed behavior of add/update user: A user can only assign user roles to a new user with less authorities than himself.

[Lars Helge Overland] Minor improvement in aggregation engine.

···

------------------------------------------
[...truncated 364 lines...]
[JENKINS] Archiving <DHIS2 App Hub; to /projects/hisp/jenkins_home/jobs/Dhis2 Web Trunk/modules/org.hisp.dhis$dhis-web-maintenance-datadictionary/builds/2011-06-11_10-18-32/archive/org.hisp.dhis/dhis-web-maintenance-datadictionary/2.3-SNAPSHOT/dhis-web-maintenance-datadictionary-2.3-SNAPSHOT.war
[INFO] [resources:resources {execution: default-resources}]
[INFO] Using encoding: 'UTF-8' to copy filtered resources.
[INFO] [compiler:compile {execution: default-compile}]
[INFO] Nothing to compile - all classes are up to date
[INFO] [findbugs:findbugs {execution: default-cli}]
[INFO] Using source root:
[INFO] <DHIS2 App Hub;
[INFO] Using test source root:
[INFO] <DHIS2 App Hub;
[INFO] No effort provided, using default effort.
[INFO] Adding Source Directory: <DHIS2 App Hub;
[INFO] No threshold provided, using default threshold.
[INFO] Using FindBugs Version: 1.3.8
[INFO] No threshold provided, using default threshold.
[INFO] No threshold provided, using default threshold.
[INFO] No threshold provided, using default threshold.
[INFO] Using the xdoc format
[INFO] No effort provided, using default effort.
[INFO] No threshold provided, using default threshold.
[INFO] No threshold provided, using default threshold.
[INFO] Debugging is Off
[INFO] No bug include filter.
[INFO] Using bug exclude filter /tmp/plexus-resources1201475572tmp
[FINDBUGS] Successfully parsed file <DHIS2 App Hub; of module DHIS Data Dictionary with 2 warnings.[INFO] Printing Errors
[INFO] Printing Missing classes
[INFO] Printing Source Roots

[INFO] ------------------------------------------------------------------------
[INFO] Building DHIS Organisation Unit Management
[INFO] task-segment: [clean, install, findbugs:findbugs]
[INFO] ------------------------------------------------------------------------
[INFO] [clean:clean {execution: default-clean}]
[INFO] Deleting directory <DHIS2 App Hub;
[INFO] [resources:resources {execution: default-resources}]
[INFO] Using encoding: 'UTF-8' to copy filtered resources.
[INFO] [compiler:compile {execution: default-compile}]
[INFO] Compiling 32 source files to <DHIS2 App Hub;
[INFO] [resources:testResources {execution: default-testResources}]
[INFO] Using encoding: 'UTF-8' to copy filtered resources.
[INFO] [compiler:testCompile {execution: default-testCompile}]
[INFO] No sources to compile
[WARNING] DEPRECATED [systemProperties]: Use systemPropertyVariables instead.
[INFO] [surefire:test {execution: default-test}]
[INFO] No tests to run.
[INFO] Surefire report directory: <DHIS2 App Hub;

-------------------------------------------------------
T E S T S
-------------------------------------------------------
There are no tests to run.

Results :

Tests run: 0, Failures: 0, Errors: 0, Skipped: 0

[JENKINS] Recording test results
[INFO] [war:war {execution: default-war}]
[INFO] Exploding webapp...
[INFO] Assembling webapp dhis-web-maintenance-organisationunit in <DHIS2 App Hub;
[INFO] Copy webapp webResources to <DHIS2 App Hub;
[INFO] Building jar: <DHIS2 App Hub;
[INFO] Expanding: <DHIS2 App Hub; into <DHIS2 App Hub;
[INFO] Overlaying 1 war(s).
[INFO] Generating war <DHIS2 App Hub;
[INFO] Building war: <DHIS2 App Hub;
[INFO] [install:install {execution: default-install}]
[INFO] Installing <DHIS2 App Hub; to /ifi/utgard/p01/dhis/.m2/repository/org/hisp/dhis/dhis-web-maintenance-organisationunit/2.3-SNAPSHOT/dhis-web-maintenance-organisationunit-2.3-SNAPSHOT.war
[INFO] Preparing findbugs:findbugs
[JENKINS] Archiving <DHIS2 App Hub; to /projects/hisp/jenkins_home/jobs/Dhis2 Web Trunk/modules/org.hisp.dhis$dhis-web-maintenance-organisationunit/builds/2011-06-11_10-18-32/archive/org.hisp.dhis/dhis-web-maintenance-organisationunit/2.3-SNAPSHOT/dhis-web-maintenance-organisationunit-2.3-SNAPSHOT.pom
[JENKINS] Archiving <DHIS2 App Hub; to /projects/hisp/jenkins_home/jobs/Dhis2 Web Trunk/modules/org.hisp.dhis$dhis-web-maintenance-organisationunit/builds/2011-06-11_10-18-32/archive/org.hisp.dhis/dhis-web-maintenance-organisationunit/2.3-SNAPSHOT/dhis-web-maintenance-organisationunit-2.3-SNAPSHOT.war
[INFO] [resources:resources {execution: default-resources}]
[INFO] Using encoding: 'UTF-8' to copy filtered resources.
[INFO] [compiler:compile {execution: default-compile}]
[INFO] Nothing to compile - all classes are up to date
[INFO] [findbugs:findbugs {execution: default-cli}]
[INFO] Using source root:
[INFO] <DHIS2 App Hub;
[INFO] Using test source root:
[INFO] <DHIS2 App Hub;
[INFO] No effort provided, using default effort.
[INFO] Adding Source Directory: <DHIS2 App Hub;
[INFO] No threshold provided, using default threshold.
[INFO] Using FindBugs Version: 1.3.8
[INFO] No threshold provided, using default threshold.
[INFO] No threshold provided, using default threshold.
[INFO] No threshold provided, using default threshold.
[INFO] Using the xdoc format
[INFO] No effort provided, using default effort.
[INFO] No threshold provided, using default threshold.
[INFO] No threshold provided, using default threshold.
[INFO] Debugging is Off
[INFO] No bug include filter.
[INFO] Using bug exclude filter /tmp/plexus-resources1870635693tmp
[INFO] Printing Errors
[INFO] Printing Missing classes
[INFO] Printing Source Roots
[FINDBUGS] Successfully parsed file <DHIS2 App Hub; of module DHIS Organisation Unit Management with 6 warnings.
[INFO] ------------------------------------------------------------------------
[INFO] Building DHIS Setting Maintenance
[INFO] task-segment: [clean, install, findbugs:findbugs]
[INFO] ------------------------------------------------------------------------
[INFO] [clean:clean {execution: default-clean}]
[INFO] Deleting directory <DHIS2 App Hub;
[INFO] [resources:resources {execution: default-resources}]
[INFO] Using encoding: 'UTF-8' to copy filtered resources.
[INFO] [compiler:compile {execution: default-compile}]
[INFO] Compiling 11 source files to <DHIS2 App Hub;
[INFO] [resources:testResources {execution: default-testResources}]
[INFO] Using encoding: 'UTF-8' to copy filtered resources.
[INFO] [compiler:testCompile {execution: default-testCompile}]
[INFO] No sources to compile
[WARNING] DEPRECATED [systemProperties]: Use systemPropertyVariables instead.
[INFO] [surefire:test {execution: default-test}]
[INFO] No tests to run.
[INFO] Surefire report directory: <DHIS2 App Hub;

-------------------------------------------------------
T E S T S
-------------------------------------------------------
There are no tests to run.

Results :

Tests run: 0, Failures: 0, Errors: 0, Skipped: 0

[JENKINS] Recording test results
[INFO] [war:war {execution: default-war}]
[INFO] Exploding webapp...
[INFO] Assembling webapp dhis-web-maintenance-settings in <DHIS2 App Hub;
[INFO] Copy webapp webResources to <DHIS2 App Hub;
[INFO] Building jar: <DHIS2 App Hub;
[INFO] Expanding: <DHIS2 App Hub; into <DHIS2 App Hub;
[INFO] Overlaying 1 war(s).
[INFO] Generating war <DHIS2 App Hub;
[INFO] Building war: <DHIS2 App Hub;
[INFO] [install:install {execution: default-install}]
[INFO] Installing <DHIS2 App Hub; to /ifi/utgard/p01/dhis/.m2/repository/org/hisp/dhis/dhis-web-maintenance-settings/2.3-SNAPSHOT/dhis-web-maintenance-settings-2.3-SNAPSHOT.war
[INFO] Preparing findbugs:findbugs
[JENKINS] Archiving <DHIS2 App Hub; to /projects/hisp/jenkins_home/jobs/Dhis2 Web Trunk/modules/org.hisp.dhis$dhis-web-maintenance-settings/builds/2011-06-11_10-18-32/archive/org.hisp.dhis/dhis-web-maintenance-settings/2.3-SNAPSHOT/dhis-web-maintenance-settings-2.3-SNAPSHOT.pom
[JENKINS] Archiving <DHIS2 App Hub; to /projects/hisp/jenkins_home/jobs/Dhis2 Web Trunk/modules/org.hisp.dhis$dhis-web-maintenance-settings/builds/2011-06-11_10-18-32/archive/org.hisp.dhis/dhis-web-maintenance-settings/2.3-SNAPSHOT/dhis-web-maintenance-settings-2.3-SNAPSHOT.war
[INFO] [resources:resources {execution: default-resources}]
[INFO] Using encoding: 'UTF-8' to copy filtered resources.
[INFO] [compiler:compile {execution: default-compile}]
[INFO] Nothing to compile - all classes are up to date
[INFO] [findbugs:findbugs {execution: default-cli}]
[INFO] Using source root:
[INFO] <DHIS2 App Hub;
[INFO] Using test source root:
[INFO] <DHIS2 App Hub;
[INFO] No effort provided, using default effort.
[INFO] Adding Source Directory: <DHIS2 App Hub;
[INFO] No threshold provided, using default threshold.
[INFO] Using FindBugs Version: 1.3.8
[INFO] No threshold provided, using default threshold.
[INFO] No threshold provided, using default threshold.
[INFO] No threshold provided, using default threshold.
[INFO] Using the xdoc format
[INFO] No effort provided, using default effort.
[INFO] No threshold provided, using default threshold.
[INFO] No threshold provided, using default threshold.
[INFO] Debugging is Off
[INFO] No bug include filter.
[INFO] Using bug exclude filter /tmp/plexus-resources1773497101tmp
[FINDBUGS] Successfully parsed file <DHIS2 App Hub; of module DHIS Setting Maintenance with 2 warnings.
[INFO] Printing Errors
[INFO] Printing Missing classes
[INFO] Printing Source Roots
[INFO] ------------------------------------------------------------------------
[INFO] Building DHIS User Maintenance
[INFO] task-segment: [clean, install, findbugs:findbugs]
[INFO] ------------------------------------------------------------------------
[INFO] [clean:clean {execution: default-clean}]
[INFO] Deleting directory <DHIS2 App Hub;
[INFO] [resources:resources {execution: default-resources}]
[INFO] Using encoding: 'UTF-8' to copy filtered resources.
[INFO] [compiler:compile {execution: default-compile}]
[INFO] Compiling 26 source files to <DHIS2 App Hub;
[INFO] -------------------------------------------------------------
[ERROR] COMPILATION ERROR :
[INFO] -------------------------------------------------------------
[ERROR] <DHIS2 App Hub cannot find symbol
symbol : class UserAuthorityGroupSubsetFilter
location: package org.hisp.dhis.system.filter
[ERROR] <DHIS2 App Hub cannot find symbol
symbol : class UserAuthorityGroupSubsetFilter
location: class org.hisp.dhis.user.action.SetupTreeAction
[ERROR] <DHIS2 App Hub cannot find symbol
symbol : method getUserCredentials()
location: class org.hisp.dhis.user.User
[ERROR] <DHIS2 App Hub cannot find symbol
symbol : method canIssue(org.hisp.dhis.user.UserAuthorityGroup)
location: class org.hisp.dhis.user.UserCredentials
[ERROR] <DHIS2 App Hub cannot find symbol
symbol : method setUserCredentials(org.hisp.dhis.user.UserCredentials)
location: class org.hisp.dhis.user.User
[ERROR] <DHIS2 App Hub cannot find symbol
symbol : method getUserCredentials()
location: class org.hisp.dhis.user.User
[ERROR] <DHIS2 App Hub cannot find symbol
symbol : method canIssue(org.hisp.dhis.user.UserAuthorityGroup)
location: class org.hisp.dhis.user.UserCredentials
[INFO] 7 errors
[INFO] -------------------------------------------------------------
[JENKINS] Archiving <DHIS2 App Hub; to /projects/hisp/jenkins_home/jobs/Dhis2 Web Trunk/modules/org.hisp.dhis$dhis-web-maintenance-user/builds/2011-06-11_10-18-32/archive/org.hisp.dhis/dhis-web-maintenance-user/2.3-SNAPSHOT/dhis-web-maintenance-user-2.3-SNAPSHOT.pom
[INFO] ------------------------------------------------------------------------
[ERROR] BUILD FAILURE
[INFO] ------------------------------------------------------------------------
[INFO] Compilation failure

<DHIS2 App Hub cannot find symbol
symbol : class UserAuthorityGroupSubsetFilter
location: package org.hisp.dhis.system.filter
<DHIS2 App Hub cannot find symbol
symbol : class UserAuthorityGroupSubsetFilter
location: class org.hisp.dhis.user.action.SetupTreeAction
<DHIS2 App Hub cannot find symbol
symbol : method getUserCredentials()
location: class org.hisp.dhis.user.User
<DHIS2 App Hub cannot find symbol
symbol : method canIssue(org.hisp.dhis.user.UserAuthorityGroup)
location: class org.hisp.dhis.user.UserCredentials
<DHIS2 App Hub cannot find symbol
symbol : method setUserCredentials(org.hisp.dhis.user.UserCredentials)
location: class org.hisp.dhis.user.User
<DHIS2 App Hub cannot find symbol
symbol : method getUserCredentials()
location: class org.hisp.dhis.user.User
<DHIS2 App Hub cannot find symbol
symbol : method canIssue(org.hisp.dhis.user.UserAuthorityGroup)
location: class org.hisp.dhis.user.UserCredentials

[INFO] ------------------------------------------------------------------------
[INFO] For more information, run Maven with the -e switch
[INFO] ------------------------------------------------------------------------
[INFO] Total time: 6 minutes 49 seconds
[INFO] Finished at: Sat Jun 11 10:25:28 CEST 2011
[INFO] Final Memory: 105M/251M
[INFO] ------------------------------------------------------------------------
Sending e-mails to: dhis2-devs@lists.launchpad.net
channel stopped
Archiving artifacts
ERROR: Ignore Problem expanding maven opts macros org.jenkinsci.plugins.tokenmacro.TokenMacro
Performing Post build task...
Could not match :DHIS Web Portal ....................................... SUCCESS : False
Logical operation result is FALSE
Skipping script : /ifi/utgard/p01/dhis/bin/ci/trunk.sh

END OF POST BUILD TASK : 0

See <DHIS2 App Hub;