Build failed in Jenkins: Dhis2 Web Trunk #2606

See <http://dhis.uio.no/ci/job/Dhis2%20Web%20Trunk/2606/changes>

Changes:

[Tran Chau] Fix bug: Visitplans are shown with completed-programStageIsntance as "true".

[Kim Anh Vo] local vn - Applied file patch from Hieu into using jquery.upload instead of ajaxFileUpload

···

------------------------------------------
[...truncated 1035 lines...]
[INFO] [compiler:testCompile {execution: default-testCompile}]
[INFO] No sources to compile
[WARNING] DEPRECATED [systemProperties]: Use systemPropertyVariables instead.
[INFO] [surefire:test {execution: default-test}]
[INFO] No tests to run.
[INFO] Surefire report directory: <http://dhis.uio.no/ci/job/Dhis2%20Web%20Trunk/ws/dhis-2/dhis-web/dhis-web-reporting/target/surefire-reports>

-------------------------------------------------------
T E S T S
-------------------------------------------------------
There are no tests to run.

Results :

Tests run: 0, Failures: 0, Errors: 0, Skipped: 0

[JENKINS] Recording test results
[INFO] [war:war {execution: default-war}]
[INFO] Exploding webapp...
[INFO] Assembling webapp dhis-web-reporting in <http://dhis.uio.no/ci/job/Dhis2%20Web%20Trunk/ws/dhis-2/dhis-web/dhis-web-reporting/target/dhis-web-reporting>
[INFO] Copy webapp webResources to <http://dhis.uio.no/ci/job/Dhis2%20Web%20Trunk/ws/dhis-2/dhis-web/dhis-web-reporting/target/dhis-web-reporting>
[INFO] Building jar: <http://dhis.uio.no/ci/job/Dhis2%20Web%20Trunk/ws/dhis-2/dhis-web/dhis-web-reporting/target/dhis-web-reporting/WEB-INF/lib/dhis-web-reporting.jar>
[INFO] Expanding: <http://dhis.uio.no/ci/job/Dhis2%20Web%20Trunk/ws/dhis-2/dhis-web/dhis-web-commons-resources/target/dhis-web-commons-resources-2.3-SNAPSHOT.war> into <http://dhis.uio.no/ci/job/Dhis2%20Web%20Trunk/ws/dhis-2/dhis-web/dhis-web-reporting/target/war/work/dhis-web-commons-resources-2.3-SNAPSHOT>
[INFO] Overlaying 1 war(s).
[INFO] Generating war <http://dhis.uio.no/ci/job/Dhis2%20Web%20Trunk/ws/dhis-2/dhis-web/dhis-web-reporting/target/dhis-web-reporting.war>
[INFO] Building war: <http://dhis.uio.no/ci/job/Dhis2%20Web%20Trunk/ws/dhis-2/dhis-web/dhis-web-reporting/target/dhis-web-reporting.war>
[INFO] [install:install {execution: default-install}]
[INFO] Installing <http://dhis.uio.no/ci/job/Dhis2%20Web%20Trunk/ws/dhis-2/dhis-web/dhis-web-reporting/target/dhis-web-reporting.war> to /ifi/utgard/p01/dhis/.m2/repository/org/hisp/dhis/dhis-web-reporting/2.3-SNAPSHOT/dhis-web-reporting-2.3-SNAPSHOT.war
[INFO] Preparing findbugs:findbugs
[JENKINS] Archiving <http://dhis.uio.no/ci/job/Dhis2%20Web%20Trunk/ws/dhis-2/dhis-web/dhis-web-reporting/pom.xml> to /projects/hisp/jenkins_home/jobs/Dhis2 Web Trunk/modules/org.hisp.dhis$dhis-web-reporting/builds/2011-05-23_08-20-37/archive/org.hisp.dhis/dhis-web-reporting/2.3-SNAPSHOT/dhis-web-reporting-2.3-SNAPSHOT.pom
[JENKINS] Archiving <http://dhis.uio.no/ci/job/Dhis2%20Web%20Trunk/ws/dhis-2/dhis-web/dhis-web-reporting/target/dhis-web-reporting.war> to /projects/hisp/jenkins_home/jobs/Dhis2 Web Trunk/modules/org.hisp.dhis$dhis-web-reporting/builds/2011-05-23_08-20-37/archive/org.hisp.dhis/dhis-web-reporting/2.3-SNAPSHOT/dhis-web-reporting-2.3-SNAPSHOT.war
[INFO] [resources:resources {execution: default-resources}]
[INFO] Using encoding: 'UTF-8' to copy filtered resources.
[INFO] [compiler:compile {execution: default-compile}]
[INFO] Nothing to compile - all classes are up to date
[INFO] [findbugs:findbugs {execution: default-cli}]
[INFO] Using source root:
[INFO] <http://dhis.uio.no/ci/job/Dhis2%20Web%20Trunk/ws/dhis-2/dhis-web/dhis-web-reporting/target/classes>
[INFO] Using test source root:
[INFO] <http://dhis.uio.no/ci/job/Dhis2%20Web%20Trunk/ws/dhis-2/dhis-web/dhis-web-reporting/target/test-classes>
[INFO] No effort provided, using default effort.
[INFO] Adding Source Directory: <http://dhis.uio.no/ci/job/Dhis2%20Web%20Trunk/ws/dhis-2/dhis-web/dhis-web-reporting/src/main/java>
[INFO] No threshold provided, using default threshold.
[INFO] Using FindBugs Version: 1.3.8
[INFO] No threshold provided, using default threshold.
[INFO] No threshold provided, using default threshold.
[INFO] No threshold provided, using default threshold.
[INFO] Using the xdoc format
[INFO] No effort provided, using default effort.
[INFO] No threshold provided, using default threshold.
[INFO] No threshold provided, using default threshold.
[INFO] Debugging is Off
[INFO] No bug include filter.
[INFO] Using bug exclude filter /tmp/plexus-resources1048469236tmp
[INFO] Printing Errors
[INFO] Printing Missing classes
[INFO] Printing Source Roots
[FINDBUGS] Successfully parsed file <http://dhis.uio.no/ci/job/Dhis2%20Web%20Trunk/ws/dhis-2/dhis-web/dhis-web-reporting/target/findbugsXml.xml> of module DHIS Web Reporting with 9 warnings.
[INFO] ------------------------------------------------------------------------
[INFO] Building DHIS Mapping
[INFO] task-segment: [clean, install, findbugs:findbugs]
[INFO] ------------------------------------------------------------------------
[INFO] [clean:clean {execution: default-clean}]
[INFO] Deleting directory <http://dhis.uio.no/ci/job/Dhis2%20Web%20Trunk/ws/dhis-2/dhis-web/dhis-web-mapping/target>
[INFO] [resources:resources {execution: default-resources}]
[INFO] Using encoding: 'UTF-8' to copy filtered resources.
[INFO] [compiler:compile {execution: default-compile}]
[INFO] Compiling 53 source files to <http://dhis.uio.no/ci/job/Dhis2%20Web%20Trunk/ws/dhis-2/dhis-web/dhis-web-mapping/target/classes>
[INFO] [resources:testResources {execution: default-testResources}]
[INFO] Using encoding: 'UTF-8' to copy filtered resources.
[INFO] [compiler:testCompile {execution: default-testCompile}]
[INFO] No sources to compile
[WARNING] DEPRECATED [systemProperties]: Use systemPropertyVariables instead.
[INFO] [surefire:test {execution: default-test}]
[INFO] No tests to run.
[INFO] Surefire report directory: <http://dhis.uio.no/ci/job/Dhis2%20Web%20Trunk/ws/dhis-2/dhis-web/dhis-web-mapping/target/surefire-reports>

-------------------------------------------------------
T E S T S
-------------------------------------------------------
There are no tests to run.

Results :

Tests run: 0, Failures: 0, Errors: 0, Skipped: 0

[JENKINS] Recording test results
[INFO] [war:war {execution: default-war}]
[INFO] Exploding webapp...
[INFO] Assembling webapp dhis-web-mapping in <http://dhis.uio.no/ci/job/Dhis2%20Web%20Trunk/ws/dhis-2/dhis-web/dhis-web-mapping/target/dhis-web-mapping>
[INFO] Copy webapp webResources to <http://dhis.uio.no/ci/job/Dhis2%20Web%20Trunk/ws/dhis-2/dhis-web/dhis-web-mapping/target/dhis-web-mapping>
[INFO] Building jar: <http://dhis.uio.no/ci/job/Dhis2%20Web%20Trunk/ws/dhis-2/dhis-web/dhis-web-mapping/target/dhis-web-mapping/WEB-INF/lib/dhis-web-mapping.jar>
[INFO] Expanding: <http://dhis.uio.no/ci/job/Dhis2%20Web%20Trunk/ws/dhis-2/dhis-web/dhis-web-commons-resources/target/dhis-web-commons-resources-2.3-SNAPSHOT.war> into <http://dhis.uio.no/ci/job/Dhis2%20Web%20Trunk/ws/dhis-2/dhis-web/dhis-web-mapping/target/war/work/dhis-web-commons-resources-2.3-SNAPSHOT>
[INFO] Overlaying 1 war(s).
[INFO] Generating war <http://dhis.uio.no/ci/job/Dhis2%20Web%20Trunk/ws/dhis-2/dhis-web/dhis-web-mapping/target/dhis-web-mapping.war>
[INFO] Building war: <http://dhis.uio.no/ci/job/Dhis2%20Web%20Trunk/ws/dhis-2/dhis-web/dhis-web-mapping/target/dhis-web-mapping.war>
[INFO] [install:install {execution: default-install}]
[INFO] Installing <http://dhis.uio.no/ci/job/Dhis2%20Web%20Trunk/ws/dhis-2/dhis-web/dhis-web-mapping/target/dhis-web-mapping.war> to /ifi/utgard/p01/dhis/.m2/repository/org/hisp/dhis/dhis-web-mapping/2.3-SNAPSHOT/dhis-web-mapping-2.3-SNAPSHOT.war
[INFO] Preparing findbugs:findbugs
[JENKINS] Archiving <http://dhis.uio.no/ci/job/Dhis2%20Web%20Trunk/ws/dhis-2/dhis-web/dhis-web-mapping/pom.xml> to /projects/hisp/jenkins_home/jobs/Dhis2 Web Trunk/modules/org.hisp.dhis$dhis-web-mapping/builds/2011-05-23_08-20-37/archive/org.hisp.dhis/dhis-web-mapping/2.3-SNAPSHOT/dhis-web-mapping-2.3-SNAPSHOT.pom
[JENKINS] Archiving <http://dhis.uio.no/ci/job/Dhis2%20Web%20Trunk/ws/dhis-2/dhis-web/dhis-web-mapping/target/dhis-web-mapping.war> to /projects/hisp/jenkins_home/jobs/Dhis2 Web Trunk/modules/org.hisp.dhis$dhis-web-mapping/builds/2011-05-23_08-20-37/archive/org.hisp.dhis/dhis-web-mapping/2.3-SNAPSHOT/dhis-web-mapping-2.3-SNAPSHOT.war
[INFO] [resources:resources {execution: default-resources}]
[INFO] Using encoding: 'UTF-8' to copy filtered resources.
[INFO] [compiler:compile {execution: default-compile}]
[INFO] Nothing to compile - all classes are up to date
[INFO] [findbugs:findbugs {execution: default-cli}]
[INFO] Using source root:
[INFO] <http://dhis.uio.no/ci/job/Dhis2%20Web%20Trunk/ws/dhis-2/dhis-web/dhis-web-mapping/target/classes>
[INFO] Using test source root:
[INFO] <http://dhis.uio.no/ci/job/Dhis2%20Web%20Trunk/ws/dhis-2/dhis-web/dhis-web-mapping/target/test-classes>
[INFO] No effort provided, using default effort.
[INFO] Adding Source Directory: <http://dhis.uio.no/ci/job/Dhis2%20Web%20Trunk/ws/dhis-2/dhis-web/dhis-web-mapping/src/main/java>
[INFO] No threshold provided, using default threshold.
[INFO] Using FindBugs Version: 1.3.8
[INFO] No threshold provided, using default threshold.
[INFO] No threshold provided, using default threshold.
[INFO] No threshold provided, using default threshold.
[INFO] Using the xdoc format
[INFO] No effort provided, using default effort.
[INFO] No threshold provided, using default threshold.
[INFO] No threshold provided, using default threshold.
[INFO] Debugging is Off
[INFO] No bug include filter.
[INFO] Using bug exclude filter /tmp/plexus-resources256465092tmp
[FINDBUGS] Successfully parsed file <http://dhis.uio.no/ci/job/Dhis2%20Web%20Trunk/ws/dhis-2/dhis-web/dhis-web-mapping/target/findbugsXml.xml> of module DHIS Mapping with 5 warnings.
[INFO] Printing Errors
[INFO] Printing Missing classes
[INFO] Printing Source Roots
[INFO] ------------------------------------------------------------------------
[INFO] Building DHIS Web Dashboard Integration module
[INFO] task-segment: [clean, install, findbugs:findbugs]
[INFO] ------------------------------------------------------------------------
[INFO] [clean:clean {execution: default-clean}]
[INFO] Deleting directory <http://dhis.uio.no/ci/job/Dhis2%20Web%20Trunk/ws/dhis-2/dhis-web/dhis-web-dashboard-integration/target>
[INFO] [resources:resources {execution: default-resources}]
[INFO] Using encoding: 'UTF-8' to copy filtered resources.
[INFO] [compiler:compile {execution: default-compile}]
[INFO] Compiling 14 source files to <http://dhis.uio.no/ci/job/Dhis2%20Web%20Trunk/ws/dhis-2/dhis-web/dhis-web-dashboard-integration/target/classes>
[INFO] [resources:testResources {execution: default-testResources}]
[INFO] Using encoding: 'UTF-8' to copy filtered resources.
[INFO] [compiler:testCompile {execution: default-testCompile}]
[INFO] No sources to compile
[WARNING] DEPRECATED [systemProperties]: Use systemPropertyVariables instead.
[INFO] [surefire:test {execution: default-test}]
[INFO] No tests to run.
[INFO] Surefire report directory: <http://dhis.uio.no/ci/job/Dhis2%20Web%20Trunk/ws/dhis-2/dhis-web/dhis-web-dashboard-integration/target/surefire-reports>

-------------------------------------------------------
T E S T S
-------------------------------------------------------
There are no tests to run.

Results :

Tests run: 0, Failures: 0, Errors: 0, Skipped: 0

[JENKINS] Recording test results
[INFO] [war:war {execution: default-war}]
[INFO] Exploding webapp...
[INFO] Assembling webapp dhis-web-dashboard-integration in <http://dhis.uio.no/ci/job/Dhis2%20Web%20Trunk/ws/dhis-2/dhis-web/dhis-web-dashboard-integration/target/dhis-web-dashboard-integration>
[INFO] Copy webapp webResources to <http://dhis.uio.no/ci/job/Dhis2%20Web%20Trunk/ws/dhis-2/dhis-web/dhis-web-dashboard-integration/target/dhis-web-dashboard-integration>
[INFO] Building jar: <http://dhis.uio.no/ci/job/Dhis2%20Web%20Trunk/ws/dhis-2/dhis-web/dhis-web-dashboard-integration/target/dhis-web-dashboard-integration/WEB-INF/lib/dhis-web-dashboard-integration.jar>
[INFO] Expanding: <http://dhis.uio.no/ci/job/Dhis2%20Web%20Trunk/ws/dhis-2/dhis-web/dhis-web-commons-resources/target/dhis-web-commons-resources-2.3-SNAPSHOT.war> into <http://dhis.uio.no/ci/job/Dhis2%20Web%20Trunk/ws/dhis-2/dhis-web/dhis-web-dashboard-integration/target/war/work/dhis-web-commons-resources-2.3-SNAPSHOT>
[INFO] Overlaying 1 war(s).
[INFO] Generating war <http://dhis.uio.no/ci/job/Dhis2%20Web%20Trunk/ws/dhis-2/dhis-web/dhis-web-dashboard-integration/target/dhis-web-dashboard-integration.war>
[INFO] Building war: <http://dhis.uio.no/ci/job/Dhis2%20Web%20Trunk/ws/dhis-2/dhis-web/dhis-web-dashboard-integration/target/dhis-web-dashboard-integration.war>
[INFO] [install:install {execution: default-install}]
[INFO] Installing <http://dhis.uio.no/ci/job/Dhis2%20Web%20Trunk/ws/dhis-2/dhis-web/dhis-web-dashboard-integration/target/dhis-web-dashboard-integration.war> to /ifi/utgard/p01/dhis/.m2/repository/org/hisp/dhis/dhis-web-dashboard-integration/2.3-SNAPSHOT/dhis-web-dashboard-integration-2.3-SNAPSHOT.war
[INFO] Preparing findbugs:findbugs
[JENKINS] Archiving <http://dhis.uio.no/ci/job/Dhis2%20Web%20Trunk/ws/dhis-2/dhis-web/dhis-web-dashboard-integration/pom.xml> to /projects/hisp/jenkins_home/jobs/Dhis2 Web Trunk/modules/org.hisp.dhis$dhis-web-dashboard-integration/builds/2011-05-23_08-20-37/archive/org.hisp.dhis/dhis-web-dashboard-integration/2.3-SNAPSHOT/dhis-web-dashboard-integration-2.3-SNAPSHOT.pom
[JENKINS] Archiving <http://dhis.uio.no/ci/job/Dhis2%20Web%20Trunk/ws/dhis-2/dhis-web/dhis-web-dashboard-integration/target/dhis-web-dashboard-integration.war> to /projects/hisp/jenkins_home/jobs/Dhis2 Web Trunk/modules/org.hisp.dhis$dhis-web-dashboard-integration/builds/2011-05-23_08-20-37/archive/org.hisp.dhis/dhis-web-dashboard-integration/2.3-SNAPSHOT/dhis-web-dashboard-integration-2.3-SNAPSHOT.war
[INFO] [resources:resources {execution: default-resources}]
[INFO] Using encoding: 'UTF-8' to copy filtered resources.
[INFO] [compiler:compile {execution: default-compile}]
[INFO] Nothing to compile - all classes are up to date
[INFO] [findbugs:findbugs {execution: default-cli}]
[INFO] Using source root:
[INFO] <http://dhis.uio.no/ci/job/Dhis2%20Web%20Trunk/ws/dhis-2/dhis-web/dhis-web-dashboard-integration/target/classes>
[INFO] Using test source root:
[INFO] <http://dhis.uio.no/ci/job/Dhis2%20Web%20Trunk/ws/dhis-2/dhis-web/dhis-web-dashboard-integration/target/test-classes>
[INFO] No effort provided, using default effort.
[INFO] Adding Source Directory: <http://dhis.uio.no/ci/job/Dhis2%20Web%20Trunk/ws/dhis-2/dhis-web/dhis-web-dashboard-integration/src/main/java>
[INFO] No threshold provided, using default threshold.
[INFO] Using FindBugs Version: 1.3.8
[INFO] No threshold provided, using default threshold.
[INFO] No threshold provided, using default threshold.
[INFO] No threshold provided, using default threshold.
[INFO] Using the xdoc format
[INFO] No effort provided, using default effort.
[INFO] No threshold provided, using default threshold.
[INFO] No threshold provided, using default threshold.
[INFO] Debugging is Off
[INFO] No bug include filter.
[INFO] Using bug exclude filter /tmp/plexus-resources676721580tmp
[INFO] Printing Errors
[INFO] Printing Missing classes
[INFO] Printing Source Roots
[FINDBUGS] Successfully parsed file <http://dhis.uio.no/ci/job/Dhis2%20Web%20Trunk/ws/dhis-2/dhis-web/dhis-web-dashboard-integration/target/findbugsXml.xml> of module DHIS Web Dashboard Integration module with 0 warnings.
[INFO] ------------------------------------------------------------------------
[INFO] Building DHIS Case Entry
[INFO] task-segment: [clean, install, findbugs:findbugs]
[INFO] ------------------------------------------------------------------------
[INFO] [clean:clean {execution: default-clean}]
[INFO] Deleting directory <http://dhis.uio.no/ci/job/Dhis2%20Web%20Trunk/ws/dhis-2/dhis-web/dhis-web-caseentry/target>
[INFO] [resources:resources {execution: default-resources}]
[INFO] Using encoding: 'UTF-8' to copy filtered resources.
[INFO] [compiler:compile {execution: default-compile}]
[INFO] Compiling 39 source files to <http://dhis.uio.no/ci/job/Dhis2%20Web%20Trunk/ws/dhis-2/dhis-web/dhis-web-caseentry/target/classes>
[INFO] -------------------------------------------------------------
[ERROR] COMPILATION ERROR :
[INFO] -------------------------------------------------------------
[ERROR] <http://dhis.uio.no/ci/job/Dhis2%20Web%20Trunk/ws/dhis-2/dhis-web/dhis-web-caseentry/src/main/java/org/hisp/dhis/caseentry/action/visitplan/SearchVisitPlanAction.java>:[174,35] cannot find symbol
symbol : method countActivitiesByProvider(org.hisp.dhis.organisationunit.OrganisationUnit)
location: interface org.hisp.dhis.activityplan.ActivityPlanService
[ERROR] <http://dhis.uio.no/ci/job/Dhis2%20Web%20Trunk/ws/dhis-2/dhis-web/dhis-web-caseentry/src/main/java/org/hisp/dhis/caseentry/action/visitplan/SearchVisitPlanAction.java>:[178,65] cannot find symbol
symbol : method getActivitiesByProvider(org.hisp.dhis.organisationunit.OrganisationUnit,int,int)
location: interface org.hisp.dhis.activityplan.ActivityPlanService
[INFO] 2 errors
[INFO] -------------------------------------------------------------
[JENKINS] Archiving <http://dhis.uio.no/ci/job/Dhis2%20Web%20Trunk/ws/dhis-2/dhis-web/dhis-web-caseentry/pom.xml> to /projects/hisp/jenkins_home/jobs/Dhis2 Web Trunk/modules/org.hisp.dhis$dhis-web-caseentry/builds/2011-05-23_08-20-37/archive/org.hisp.dhis/dhis-web-caseentry/2.3-SNAPSHOT/dhis-web-caseentry-2.3-SNAPSHOT.pom
[INFO] ------------------------------------------------------------------------
[ERROR] BUILD FAILURE
[INFO] ------------------------------------------------------------------------
[INFO] Compilation failure

<http://dhis.uio.no/ci/job/Dhis2%20Web%20Trunk/ws/dhis-2/dhis-web/dhis-web-caseentry/src/main/java/org/hisp/dhis/caseentry/action/visitplan/SearchVisitPlanAction.java>:[174,35] cannot find symbol
symbol : method countActivitiesByProvider(org.hisp.dhis.organisationunit.OrganisationUnit)
location: interface org.hisp.dhis.activityplan.ActivityPlanService
<http://dhis.uio.no/ci/job/Dhis2%20Web%20Trunk/ws/dhis-2/dhis-web/dhis-web-caseentry/src/main/java/org/hisp/dhis/caseentry/action/visitplan/SearchVisitPlanAction.java>:[178,65] cannot find symbol
symbol : method getActivitiesByProvider(org.hisp.dhis.organisationunit.OrganisationUnit,int,int)
location: interface org.hisp.dhis.activityplan.ActivityPlanService

[INFO] ------------------------------------------------------------------------
[INFO] For more information, run Maven with the -e switch
[INFO] ------------------------------------------------------------------------
[INFO] Total time: 17 minutes 33 seconds
[INFO] Finished at: Mon May 23 08:38:18 CEST 2011
[INFO] Final Memory: 179M/451M
[INFO] ------------------------------------------------------------------------
Sending e-mails to: dhis2-devs@lists.launchpad.net
channel stopped
Archiving artifacts
ERROR: Ignore Problem expanding maven opts macros org.jenkinsci.plugins.tokenmacro.TokenMacro
Performing Post build task...
Could not match :DHIS Web Portal ....................................... SUCCESS : False
Logical operation result is FALSE
Skipping script : echo "Building webapp succeeded. Deploying to dev"
/ifi/utgard/p01/dhis/bin/redeploy-dhis-snapshot
END OF POST BUILD TASK : 0

See <http://dhis.uio.no/ci/job/Dhis2%20Web%20Trunk/2607/>