Build failed in Jenkins: Dhis2 Web Trunk #2279

See <DHIS2 App Hub;

Changes:

[Tran Chau] Fix bug: Missing translations and Clumsy warning message in Patient module.

[Tran Chau] Fix bug: Non-informative text after beneficiary registration.

···

------------------------------------------
[...truncated 838 lines...]
[INFO] Using bug exclude filter /tmp/plexus-resources1098292949tmp
[INFO] Printing Errors
[INFO] Printing Missing classes
[INFO] Printing Source Roots
[FINDBUGS] Successfully parsed file <DHIS2 App Hub; of module DHIS Data Mart with 10 warnings.
[INFO] ------------------------------------------------------------------------
[INFO] Building DHIS Validation Rule
[INFO] task-segment: [clean, install, findbugs:findbugs]
[INFO] ------------------------------------------------------------------------
[INFO] [clean:clean {execution: default-clean}]
[INFO] Deleting directory <DHIS2 App Hub;
[INFO] [resources:resources {execution: default-resources}]
[INFO] Using encoding: 'UTF-8' to copy filtered resources.
[INFO] [compiler:compile {execution: default-compile}]
[INFO] Compiling 28 source files to <DHIS2 App Hub;
[INFO] [resources:testResources {execution: default-testResources}]
[INFO] Using encoding: 'UTF-8' to copy filtered resources.
[INFO] [compiler:testCompile {execution: default-testCompile}]
[INFO] No sources to compile
[INFO] [surefire:test {execution: default-test}]
[INFO] No tests to run.
[HUDSON] Recording test results
[INFO] [war:war {execution: default-war}]
[INFO] Exploding webapp...
[INFO] Assembling webapp dhis-web-validationrule in <DHIS2 App Hub;
[INFO] Copy webapp webResources to <DHIS2 App Hub;
[INFO] Building jar: <DHIS2 App Hub;
[INFO] Expanding: <DHIS2 App Hub; into <DHIS2 App Hub;
[INFO] Overlaying 1 war(s).
[INFO] Generating war <DHIS2 App Hub;
[INFO] Building war: <DHIS2 App Hub;
[INFO] [install:install {execution: default-install}]
[INFO] Installing <DHIS2 App Hub; to /ifi/utgard/p01/dhis/.m2/repository/org/hisp/dhis/dhis-web-validationrule/2.2-SNAPSHOT/dhis-web-validationrule-2.2-SNAPSHOT.war
[INFO] Preparing findbugs:findbugs
[HUDSON] Archiving <DHIS2 App Hub; to /ifi/utgard/p01/dhis/projects/dhis-dev.ifi.uio.no/ci/home/jobs/Dhis2 Web Trunk/modules/org.hisp.dhis$dhis-web-validationrule/builds/2011-03-29_05-17-17/archive/org.hisp.dhis/dhis-web-validationrule/2.2-SNAPSHOT/pom.xml
[HUDSON] Archiving <DHIS2 App Hub; to /ifi/utgard/p01/dhis/projects/dhis-dev.ifi.uio.no/ci/home/jobs/Dhis2 Web Trunk/modules/org.hisp.dhis$dhis-web-validationrule/builds/2011-03-29_05-17-17/archive/org.hisp.dhis/dhis-web-validationrule/2.2-SNAPSHOT/dhis-web-validationrule.war
[INFO] [resources:resources {execution: default-resources}]
[INFO] Using encoding: 'UTF-8' to copy filtered resources.
[INFO] [compiler:compile {execution: default-compile}]
[INFO] Nothing to compile - all classes are up to date
[INFO] [findbugs:findbugs {execution: default-cli}]
[INFO] Using source root:
[INFO] <DHIS2 App Hub;
[INFO] Using test source root:
[INFO] <DHIS2 App Hub;
[INFO] No effort provided, using default effort.
[INFO] Adding Source Directory: <DHIS2 App Hub;
[INFO] No threshold provided, using default threshold.
[INFO] Using FindBugs Version: 1.3.8
[INFO] No threshold provided, using default threshold.
[INFO] No threshold provided, using default threshold.
[INFO] No threshold provided, using default threshold.
[INFO] Using the xdoc format
[INFO] No effort provided, using default effort.
[INFO] No threshold provided, using default threshold.
[INFO] No threshold provided, using default threshold.
[INFO] Debugging is Off
[INFO] No bug include filter.
[INFO] Using bug exclude filter /tmp/plexus-resources1653318393tmp
[INFO] Printing Errors
[INFO] Printing Missing classes
[INFO] Printing Source Roots
[FINDBUGS] Successfully parsed file <DHIS2 App Hub; of module DHIS Validation Rule with 42 warnings.
[INFO] ------------------------------------------------------------------------
[INFO] Building DHIS Web Reporting
[INFO] task-segment: [clean, install, findbugs:findbugs]
[INFO] ------------------------------------------------------------------------
[INFO] [clean:clean {execution: default-clean}]
[INFO] Deleting directory <DHIS2 App Hub;
[INFO] [resources:resources {execution: default-resources}]
[INFO] Using encoding: 'UTF-8' to copy filtered resources.
[INFO] [compiler:compile {execution: default-compile}]
[INFO] Compiling 54 source files to <DHIS2 App Hub;
[INFO] [resources:testResources {execution: default-testResources}]
[INFO] Using encoding: 'UTF-8' to copy filtered resources.
[INFO] [compiler:testCompile {execution: default-testCompile}]
[INFO] No sources to compile
[INFO] [surefire:test {execution: default-test}]
[INFO] No tests to run.
[HUDSON] Recording test results
[INFO] [war:war {execution: default-war}]
[INFO] Exploding webapp...
[INFO] Assembling webapp dhis-web-reporting in <DHIS2 App Hub;
[INFO] Copy webapp webResources to <DHIS2 App Hub;
[INFO] Building jar: <DHIS2 App Hub;
[INFO] Expanding: <DHIS2 App Hub; into <DHIS2 App Hub;
[INFO] Overlaying 1 war(s).
[INFO] Generating war <DHIS2 App Hub;
[INFO] Building war: <DHIS2 App Hub;
[INFO] [install:install {execution: default-install}]
[INFO] Installing <DHIS2 App Hub; to /ifi/utgard/p01/dhis/.m2/repository/org/hisp/dhis/dhis-web-reporting/2.2-SNAPSHOT/dhis-web-reporting-2.2-SNAPSHOT.war
[INFO] Preparing findbugs:findbugs
[HUDSON] Archiving <DHIS2 App Hub; to /ifi/utgard/p01/dhis/projects/dhis-dev.ifi.uio.no/ci/home/jobs/Dhis2 Web Trunk/modules/org.hisp.dhis$dhis-web-reporting/builds/2011-03-29_05-17-17/archive/org.hisp.dhis/dhis-web-reporting/2.2-SNAPSHOT/pom.xml
[HUDSON] Archiving <DHIS2 App Hub; to /ifi/utgard/p01/dhis/projects/dhis-dev.ifi.uio.no/ci/home/jobs/Dhis2 Web Trunk/modules/org.hisp.dhis$dhis-web-reporting/builds/2011-03-29_05-17-17/archive/org.hisp.dhis/dhis-web-reporting/2.2-SNAPSHOT/dhis-web-reporting.war
[INFO] [resources:resources {execution: default-resources}]
[INFO] Using encoding: 'UTF-8' to copy filtered resources.
[INFO] [compiler:compile {execution: default-compile}]
[INFO] Nothing to compile - all classes are up to date
[INFO] [findbugs:findbugs {execution: default-cli}]
[INFO] Using source root:
[INFO] <DHIS2 App Hub;
[INFO] Using test source root:
[INFO] <DHIS2 App Hub;
[INFO] No effort provided, using default effort.
[INFO] Adding Source Directory: <DHIS2 App Hub;
[INFO] No threshold provided, using default threshold.
[INFO] Using FindBugs Version: 1.3.8
[INFO] No threshold provided, using default threshold.
[INFO] No threshold provided, using default threshold.
[INFO] No threshold provided, using default threshold.
[INFO] Using the xdoc format
[INFO] No effort provided, using default effort.
[INFO] No threshold provided, using default threshold.
[INFO] No threshold provided, using default threshold.
[INFO] Debugging is Off
[INFO] No bug include filter.
[INFO] Using bug exclude filter /tmp/plexus-resources993667246tmp
[FINDBUGS] Successfully parsed file <DHIS2 App Hub; of module DHIS Web Reporting with 27 warnings.
[INFO] Printing Errors
[INFO] Printing Missing classes
[INFO] Printing Source Roots
[INFO] ------------------------------------------------------------------------
[INFO] Building DHIS Mapping
[INFO] task-segment: [clean, install, findbugs:findbugs]
[INFO] ------------------------------------------------------------------------
[INFO] [clean:clean {execution: default-clean}]
[INFO] Deleting directory <DHIS2 App Hub;
[INFO] [resources:resources {execution: default-resources}]
[INFO] Using encoding: 'UTF-8' to copy filtered resources.
[INFO] [compiler:compile {execution: default-compile}]
[INFO] Compiling 53 source files to <DHIS2 App Hub;
[INFO] [resources:testResources {execution: default-testResources}]
[INFO] Using encoding: 'UTF-8' to copy filtered resources.
[INFO] [compiler:testCompile {execution: default-testCompile}]
[INFO] No sources to compile
[INFO] [surefire:test {execution: default-test}]
[INFO] No tests to run.
[HUDSON] Recording test results
[INFO] [war:war {execution: default-war}]
[INFO] Exploding webapp...
[INFO] Assembling webapp dhis-web-mapping in <DHIS2 App Hub;
[INFO] Copy webapp webResources to <DHIS2 App Hub;
[INFO] Building jar: <DHIS2 App Hub;
[INFO] Expanding: <DHIS2 App Hub; into <DHIS2 App Hub;
[INFO] Overlaying 1 war(s).
[INFO] Generating war <DHIS2 App Hub;
[INFO] Building war: <DHIS2 App Hub;
[INFO] [install:install {execution: default-install}]
[INFO] Installing <DHIS2 App Hub; to /ifi/utgard/p01/dhis/.m2/repository/org/hisp/dhis/dhis-web-mapping/2.2-SNAPSHOT/dhis-web-mapping-2.2-SNAPSHOT.war
[INFO] Preparing findbugs:findbugs
[HUDSON] Archiving <DHIS2 App Hub; to /ifi/utgard/p01/dhis/projects/dhis-dev.ifi.uio.no/ci/home/jobs/Dhis2 Web Trunk/modules/org.hisp.dhis$dhis-web-mapping/builds/2011-03-29_05-17-17/archive/org.hisp.dhis/dhis-web-mapping/2.2-SNAPSHOT/pom.xml
[HUDSON] Archiving <DHIS2 App Hub; to /ifi/utgard/p01/dhis/projects/dhis-dev.ifi.uio.no/ci/home/jobs/Dhis2 Web Trunk/modules/org.hisp.dhis$dhis-web-mapping/builds/2011-03-29_05-17-17/archive/org.hisp.dhis/dhis-web-mapping/2.2-SNAPSHOT/dhis-web-mapping.war
[INFO] [resources:resources {execution: default-resources}]
[INFO] Using encoding: 'UTF-8' to copy filtered resources.
[INFO] [compiler:compile {execution: default-compile}]
[INFO] Nothing to compile - all classes are up to date
[INFO] [findbugs:findbugs {execution: default-cli}]
[INFO] Using source root:
[INFO] <DHIS2 App Hub;
[INFO] Using test source root:
[INFO] <DHIS2 App Hub;
[INFO] No effort provided, using default effort.
[INFO] Adding Source Directory: <DHIS2 App Hub;
[INFO] No threshold provided, using default threshold.
[INFO] Using FindBugs Version: 1.3.8
[INFO] No threshold provided, using default threshold.
[INFO] No threshold provided, using default threshold.
[INFO] No threshold provided, using default threshold.
[INFO] Using the xdoc format
[INFO] No effort provided, using default effort.
[INFO] No threshold provided, using default threshold.
[INFO] No threshold provided, using default threshold.
[INFO] Debugging is Off
[INFO] No bug include filter.
[INFO] Using bug exclude filter /tmp/plexus-resources1641843784tmp
[FINDBUGS] Successfully parsed file <DHIS2 App Hub; of module DHIS Mapping with 12 warnings.[INFO] Printing Errors
[INFO] Printing Missing classes
[INFO] Printing Source Roots

[HUDSON] Re-archiving <DHIS2 App Hub;
[INFO] ------------------------------------------------------------------------
[INFO] Building DHIS Web Dashboard Integration module
[INFO] task-segment: [clean, install, findbugs:findbugs]
[INFO] ------------------------------------------------------------------------
[INFO] [clean:clean {execution: default-clean}]
[INFO] Deleting directory <http://dhis.uio.no/ci/job/Dhis2%20Web%20Trunk/ws/dhis-2/dhis-web/dhis-web-dashboard-integration/target&gt;
[INFO] [resources:resources {execution: default-resources}]
[INFO] Using encoding: 'UTF-8' to copy filtered resources.
[INFO] [compiler:compile {execution: default-compile}]
[INFO] Compiling 9 source files to <http://dhis.uio.no/ci/job/Dhis2%20Web%20Trunk/ws/dhis-2/dhis-web/dhis-web-dashboard-integration/target/classes&gt;
[INFO] [resources:testResources {execution: default-testResources}]
[INFO] Using encoding: 'UTF-8' to copy filtered resources.
[INFO] [compiler:testCompile {execution: default-testCompile}]
[INFO] No sources to compile
[INFO] [surefire:test {execution: default-test}]
[INFO] No tests to run.
[HUDSON] Recording test results
[INFO] [war:war {execution: default-war}]
[INFO] Exploding webapp...
[INFO] Assembling webapp dhis-web-dashboard-integration in <http://dhis.uio.no/ci/job/Dhis2%20Web%20Trunk/ws/dhis-2/dhis-web/dhis-web-dashboard-integration/target/dhis-web-dashboard-integration&gt;
[INFO] Copy webapp webResources to <http://dhis.uio.no/ci/job/Dhis2%20Web%20Trunk/ws/dhis-2/dhis-web/dhis-web-dashboard-integration/target/dhis-web-dashboard-integration&gt;
[INFO] Building jar: <http://dhis.uio.no/ci/job/Dhis2%20Web%20Trunk/ws/dhis-2/dhis-web/dhis-web-dashboard-integration/target/dhis-web-dashboard-integration/WEB-INF/lib/dhis-web-dashboard-integration.jar&gt;
[INFO] Expanding: <DHIS2 App Hub; into <http://dhis.uio.no/ci/job/Dhis2%20Web%20Trunk/ws/dhis-2/dhis-web/dhis-web-dashboard-integration/target/war/work/dhis-web-commons-resources-2.2-SNAPSHOT&gt;
[INFO] Overlaying 1 war(s).
[INFO] Generating war <http://dhis.uio.no/ci/job/Dhis2%20Web%20Trunk/ws/dhis-2/dhis-web/dhis-web-dashboard-integration/target/dhis-web-dashboard-integration.war&gt;
[INFO] Building war: <http://dhis.uio.no/ci/job/Dhis2%20Web%20Trunk/ws/dhis-2/dhis-web/dhis-web-dashboard-integration/target/dhis-web-dashboard-integration.war&gt;
[HUDSON] Archiving <http://dhis.uio.no/ci/job/Dhis2%20Web%20Trunk/ws/dhis-2/dhis-web/dhis-web-dashboard-integration/pom.xml&gt; to /ifi/utgard/p01/dhis/projects/dhis-dev.ifi.uio.no/ci/home/jobs/Dhis2 Web Trunk/modules/org.hisp.dhis$dhis-web-dashboard-integration/builds/2011-03-29_05-17-17/archive/org.hisp.dhis/dhis-web-dashboard-integration/2.2-SNAPSHOT/pom.xml
[INFO] ------------------------------------------------------------------------
[ERROR] BUILD ERROR
[INFO] ------------------------------------------------------------------------
[INFO] Error assembling WAR: Problem creating war: Disk quota exceeded

[INFO] ------------------------------------------------------------------------
[INFO] For more information, run Maven with the -e switch
[INFO] ------------------------------------------------------------------------
[INFO] Total time: 13 minutes 55 seconds
[INFO] Finished at: Tue Mar 29 05:31:19 CEST 2011
[INFO] Final Memory: 185M/443M
[INFO] ------------------------------------------------------------------------
Sending e-mails to: dhis2-devs@lists.launchpad.net
channel stopped
Archiving artifacts
Performing Post build task...
Could not match :DHIS Web Portal ....................................... SUCCESS : False
Logical operation result is FALSE
Skipping script : echo "Building webapp succeeded. Deploying to dev"
/ifi/utgard/p01/dhis/bin/redeploy-dhis-snapshot
END OF POST BUILD TASK : 0
FATAL: Disk quota exceeded
java.io.IOException: Disk quota exceeded
  at java.io.FileOutputStream.close0(Native Method)
  at java.io.FileOutputStream.close(FileOutputStream.java:279)
  at sun.nio.cs.StreamEncoder.implClose(StreamEncoder.java:301)
  at sun.nio.cs.StreamEncoder.close(StreamEncoder.java:130)
  at java.io.OutputStreamWriter.close(OutputStreamWriter.java:216)
  at java.io.BufferedWriter.close(BufferedWriter.java:248)
  at hudson.util.AtomicFileWriter.close(AtomicFileWriter.java:94)
  at hudson.util.AtomicFileWriter.commit(AtomicFileWriter.java:109)
  at hudson.XmlFile.write(XmlFile.java:166)
  at hudson.model.Fingerprint.save(Fingerprint.java:704)
  at hudson.model.Fingerprint.add(Fingerprint.java:666)
  at hudson.model.Fingerprint.add(Fingerprint.java:651)
  at hudson.maven.reporters.MavenFingerprinter.aggregate(MavenFingerprinter.java:177)
  at hudson.maven.MavenModuleSetBuild$RunnerImpl.post2(MavenModuleSetBuild.java:773)
  at hudson.model.AbstractBuild$AbstractRunner.post(AbstractBuild.java:548)
  at hudson.model.Run.run(Run.java:1386)
  at hudson.maven.MavenModuleSetBuild.run(MavenModuleSetBuild.java:405)
  at hudson.model.ResourceController.execute(ResourceController.java:88)
  at hudson.model.Executor.run(Executor.java:145)

See <DHIS2 App Hub;

···

------------------------------------------
[...truncated 772 lines...]
[INFO] Using encoding: 'UTF-8' to copy filtered resources.
[INFO] [compiler:compile {execution: default-compile}]
[INFO] Nothing to compile - all classes are up to date
[INFO] [findbugs:findbugs {execution: default-cli}]
[INFO] Using source root:
[INFO] <DHIS2 App Hub;
[INFO] Using test source root:
[INFO] <DHIS2 App Hub;
[INFO] No effort provided, using default effort.
[INFO] Adding Source Directory: <DHIS2 App Hub;
[INFO] No threshold provided, using default threshold.
[INFO] Using FindBugs Version: 1.3.8
[INFO] No threshold provided, using default threshold.
[INFO] No threshold provided, using default threshold.
[INFO] No threshold provided, using default threshold.
[INFO] Using the xdoc format
[INFO] No effort provided, using default effort.
[INFO] No threshold provided, using default threshold.
[INFO] No threshold provided, using default threshold.
[INFO] Debugging is Off
[INFO] No bug include filter.
[INFO] Using bug exclude filter /tmp/plexus-resources1443615360tmp
[INFO] Printing Errors
[INFO] Printing Missing classes
[INFO] Printing Source Roots
[FINDBUGS] Successfully parsed file <DHIS2 App Hub; of module DHIS Data Mart with 10 warnings.
[INFO] ------------------------------------------------------------------------
[INFO] Building DHIS Validation Rule
[INFO] task-segment: [clean, install, findbugs:findbugs]
[INFO] ------------------------------------------------------------------------
[INFO] [clean:clean {execution: default-clean}]
[INFO] Deleting directory <DHIS2 App Hub;
[INFO] [resources:resources {execution: default-resources}]
[INFO] Using encoding: 'UTF-8' to copy filtered resources.
[INFO] [compiler:compile {execution: default-compile}]
[INFO] Compiling 28 source files to <DHIS2 App Hub;
[INFO] [resources:testResources {execution: default-testResources}]
[INFO] Using encoding: 'UTF-8' to copy filtered resources.
[INFO] [compiler:testCompile {execution: default-testCompile}]
[INFO] No sources to compile
[INFO] [surefire:test {execution: default-test}]
[INFO] No tests to run.
[HUDSON] Recording test results
[INFO] [war:war {execution: default-war}]
[INFO] Exploding webapp...
[INFO] Assembling webapp dhis-web-validationrule in <DHIS2 App Hub;
[INFO] Copy webapp webResources to <DHIS2 App Hub;
[INFO] Building jar: <DHIS2 App Hub;
[INFO] Expanding: <DHIS2 App Hub; into <DHIS2 App Hub;
[INFO] Overlaying 1 war(s).
[INFO] Generating war <DHIS2 App Hub;
[INFO] Building war: <DHIS2 App Hub;
[INFO] [install:install {execution: default-install}]
[INFO] Installing <DHIS2 App Hub; to /ifi/utgard/p01/dhis/.m2/repository/org/hisp/dhis/dhis-web-validationrule/2.2-SNAPSHOT/dhis-web-validationrule-2.2-SNAPSHOT.war
[INFO] Preparing findbugs:findbugs
[HUDSON] Archiving <DHIS2 App Hub; to /ifi/utgard/p01/dhis/projects/dhis-dev.ifi.uio.no/ci/home/jobs/Dhis2 Web Trunk/modules/org.hisp.dhis$dhis-web-validationrule/builds/2011-03-29_06-16-47/archive/org.hisp.dhis/dhis-web-validationrule/2.2-SNAPSHOT/pom.xml
[HUDSON] Archiving <DHIS2 App Hub; to /ifi/utgard/p01/dhis/projects/dhis-dev.ifi.uio.no/ci/home/jobs/Dhis2 Web Trunk/modules/org.hisp.dhis$dhis-web-validationrule/builds/2011-03-29_06-16-47/archive/org.hisp.dhis/dhis-web-validationrule/2.2-SNAPSHOT/dhis-web-validationrule.war
[INFO] [resources:resources {execution: default-resources}]
[INFO] Using encoding: 'UTF-8' to copy filtered resources.
[INFO] [compiler:compile {execution: default-compile}]
[INFO] Nothing to compile - all classes are up to date
[INFO] [findbugs:findbugs {execution: default-cli}]
[INFO] Using source root:
[INFO] <DHIS2 App Hub;
[INFO] Using test source root:
[INFO] <DHIS2 App Hub;
[INFO] No effort provided, using default effort.
[INFO] Adding Source Directory: <DHIS2 App Hub;
[INFO] No threshold provided, using default threshold.
[INFO] Using FindBugs Version: 1.3.8
[INFO] No threshold provided, using default threshold.
[INFO] No threshold provided, using default threshold.
[INFO] No threshold provided, using default threshold.
[INFO] Using the xdoc format
[INFO] No effort provided, using default effort.
[INFO] No threshold provided, using default threshold.
[INFO] No threshold provided, using default threshold.
[INFO] Debugging is Off
[INFO] No bug include filter.
[INFO] Using bug exclude filter /tmp/plexus-resources1775791884tmp
[INFO] Printing Errors
[INFO] Printing Missing classes
[INFO] Printing Source Roots
[FINDBUGS] Successfully parsed file <DHIS2 App Hub; of module DHIS Validation Rule with 42 warnings.
[INFO] ------------------------------------------------------------------------
[INFO] Building DHIS Web Reporting
[INFO] task-segment: [clean, install, findbugs:findbugs]
[INFO] ------------------------------------------------------------------------
[INFO] [clean:clean {execution: default-clean}]
[INFO] Deleting directory <DHIS2 App Hub;
[INFO] [resources:resources {execution: default-resources}]
[INFO] Using encoding: 'UTF-8' to copy filtered resources.
[INFO] [compiler:compile {execution: default-compile}]
[INFO] Compiling 54 source files to <DHIS2 App Hub;
[INFO] [resources:testResources {execution: default-testResources}]
[INFO] Using encoding: 'UTF-8' to copy filtered resources.
[INFO] [compiler:testCompile {execution: default-testCompile}]
[INFO] No sources to compile
[HUDSON] Recording test results
[INFO] [surefire:test {execution: default-test}]
[INFO] No tests to run.
[INFO] [war:war {execution: default-war}]
[INFO] Exploding webapp...
[INFO] Assembling webapp dhis-web-reporting in <DHIS2 App Hub;
[INFO] Copy webapp webResources to <DHIS2 App Hub;
[INFO] Building jar: <DHIS2 App Hub;
[INFO] Expanding: <DHIS2 App Hub; into <DHIS2 App Hub;
[INFO] Overlaying 1 war(s).
[INFO] Generating war <DHIS2 App Hub;
[INFO] Building war: <DHIS2 App Hub;
[INFO] [install:install {execution: default-install}]
[INFO] Installing <DHIS2 App Hub; to /ifi/utgard/p01/dhis/.m2/repository/org/hisp/dhis/dhis-web-reporting/2.2-SNAPSHOT/dhis-web-reporting-2.2-SNAPSHOT.war
[INFO] Preparing findbugs:findbugs
[HUDSON] Archiving <DHIS2 App Hub; to /ifi/utgard/p01/dhis/projects/dhis-dev.ifi.uio.no/ci/home/jobs/Dhis2 Web Trunk/modules/org.hisp.dhis$dhis-web-reporting/builds/2011-03-29_06-16-47/archive/org.hisp.dhis/dhis-web-reporting/2.2-SNAPSHOT/pom.xml
[HUDSON] Archiving <DHIS2 App Hub; to /ifi/utgard/p01/dhis/projects/dhis-dev.ifi.uio.no/ci/home/jobs/Dhis2 Web Trunk/modules/org.hisp.dhis$dhis-web-reporting/builds/2011-03-29_06-16-47/archive/org.hisp.dhis/dhis-web-reporting/2.2-SNAPSHOT/dhis-web-reporting.war
[INFO] [resources:resources {execution: default-resources}]
[INFO] Using encoding: 'UTF-8' to copy filtered resources.
[INFO] [compiler:compile {execution: default-compile}]
[INFO] Nothing to compile - all classes are up to date
[INFO] [findbugs:findbugs {execution: default-cli}]
[INFO] Using source root:
[INFO] <DHIS2 App Hub;
[INFO] Using test source root:
[INFO] <DHIS2 App Hub;
[INFO] No effort provided, using default effort.
[INFO] Adding Source Directory: <DHIS2 App Hub;
[INFO] No threshold provided, using default threshold.
[INFO] Using FindBugs Version: 1.3.8
[INFO] No threshold provided, using default threshold.
[INFO] No threshold provided, using default threshold.
[INFO] No threshold provided, using default threshold.
[INFO] Using the xdoc format
[INFO] No effort provided, using default effort.
[INFO] No threshold provided, using default threshold.
[INFO] No threshold provided, using default threshold.
[INFO] Debugging is Off
[INFO] No bug include filter.
[INFO] Using bug exclude filter /tmp/plexus-resources250438225tmp
[FINDBUGS] Successfully parsed file <DHIS2 App Hub; of module DHIS Web Reporting with 27 warnings.
[INFO] Printing Errors
[INFO] Printing Missing classes
[INFO] Printing Source Roots
[INFO] ------------------------------------------------------------------------
[INFO] Building DHIS Mapping
[INFO] task-segment: [clean, install, findbugs:findbugs]
[INFO] ------------------------------------------------------------------------
[INFO] [clean:clean {execution: default-clean}]
[INFO] Deleting directory <DHIS2 App Hub;
[INFO] [resources:resources {execution: default-resources}]
[INFO] Using encoding: 'UTF-8' to copy filtered resources.
[INFO] [compiler:compile {execution: default-compile}]
[INFO] Compiling 53 source files to <DHIS2 App Hub;
[INFO] [resources:testResources {execution: default-testResources}]
[INFO] Using encoding: 'UTF-8' to copy filtered resources.
[INFO] [compiler:testCompile {execution: default-testCompile}]
[INFO] No sources to compile
[INFO] [surefire:test {execution: default-test}]
[INFO] No tests to run.
[HUDSON] Recording test results
[INFO] [war:war {execution: default-war}]
[INFO] Exploding webapp...
[INFO] Assembling webapp dhis-web-mapping in <DHIS2 App Hub;
[INFO] Copy webapp webResources to <DHIS2 App Hub;
[INFO] Building jar: <DHIS2 App Hub;
[INFO] Expanding: <DHIS2 App Hub; into <DHIS2 App Hub;
[INFO] Overlaying 1 war(s).
[INFO] Generating war <DHIS2 App Hub;
[INFO] Building war: <DHIS2 App Hub;
[INFO] [install:install {execution: default-install}]
[INFO] Installing <DHIS2 App Hub; to /ifi/utgard/p01/dhis/.m2/repository/org/hisp/dhis/dhis-web-mapping/2.2-SNAPSHOT/dhis-web-mapping-2.2-SNAPSHOT.war
[INFO] Preparing findbugs:findbugs
[HUDSON] Archiving <DHIS2 App Hub; to /ifi/utgard/p01/dhis/projects/dhis-dev.ifi.uio.no/ci/home/jobs/Dhis2 Web Trunk/modules/org.hisp.dhis$dhis-web-mapping/builds/2011-03-29_06-16-48/archive/org.hisp.dhis/dhis-web-mapping/2.2-SNAPSHOT/pom.xml
[HUDSON] Archiving <DHIS2 App Hub; to /ifi/utgard/p01/dhis/projects/dhis-dev.ifi.uio.no/ci/home/jobs/Dhis2 Web Trunk/modules/org.hisp.dhis$dhis-web-mapping/builds/2011-03-29_06-16-48/archive/org.hisp.dhis/dhis-web-mapping/2.2-SNAPSHOT/dhis-web-mapping.war
[INFO] [resources:resources {execution: default-resources}]
[INFO] Using encoding: 'UTF-8' to copy filtered resources.
[INFO] [compiler:compile {execution: default-compile}]
[INFO] Nothing to compile - all classes are up to date
[INFO] [findbugs:findbugs {execution: default-cli}]
[INFO] Using source root:
[INFO] <DHIS2 App Hub;
[INFO] Using test source root:
[INFO] <http://dhis.uio.no/ci/job/Dhis2%20Web%20Trunk/ws/dhis-2/dhis-web/dhis-web-mapping/target/test-classes&gt;
[INFO] No effort provided, using default effort.
[INFO] Adding Source Directory: <http://dhis.uio.no/ci/job/Dhis2%20Web%20Trunk/ws/dhis-2/dhis-web/dhis-web-mapping/src/main/java&gt;
[INFO] No threshold provided, using default threshold.
[INFO] Using FindBugs Version: 1.3.8
[INFO] No threshold provided, using default threshold.
[INFO] No threshold provided, using default threshold.
[INFO] No threshold provided, using default threshold.
[INFO] Using the xdoc format
[INFO] No effort provided, using default effort.
[INFO] No threshold provided, using default threshold.
[INFO] No threshold provided, using default threshold.
[INFO] Debugging is Off
[INFO] No bug include filter.
[INFO] Using bug exclude filter /tmp/plexus-resources1839243748tmp
[INFO] Printing Errors
[INFO] Printing Missing classes
[INFO] Printing Source Roots
[FINDBUGS] Successfully parsed file <http://dhis.uio.no/ci/job/Dhis2%20Web%20Trunk/ws/dhis-2/dhis-web/dhis-web-mapping/target/findbugsXml.xml&gt; of module DHIS Mapping with 12 warnings.
[INFO] ------------------------------------------------------------------------
[INFO] Building DHIS Web Dashboard Integration module
[INFO] task-segment: [clean, install, findbugs:findbugs]
[INFO] ------------------------------------------------------------------------
[INFO] [clean:clean {execution: default-clean}]
[INFO] Deleting directory <http://dhis.uio.no/ci/job/Dhis2%20Web%20Trunk/ws/dhis-2/dhis-web/dhis-web-dashboard-integration/target&gt;
[INFO] [resources:resources {execution: default-resources}]
[INFO] Using encoding: 'UTF-8' to copy filtered resources.
[INFO] [compiler:compile {execution: default-compile}]
[INFO] Compiling 9 source files to <http://dhis.uio.no/ci/job/Dhis2%20Web%20Trunk/ws/dhis-2/dhis-web/dhis-web-dashboard-integration/target/classes&gt;
[INFO] [resources:testResources {execution: default-testResources}]
[INFO] Using encoding: 'UTF-8' to copy filtered resources.
[INFO] [compiler:testCompile {execution: default-testCompile}]
[INFO] No sources to compile
[HUDSON] Recording test results
[INFO] [surefire:test {execution: default-test}]
[INFO] No tests to run.
[INFO] [war:war {execution: default-war}]
[INFO] Exploding webapp...
[INFO] Assembling webapp dhis-web-dashboard-integration in <http://dhis.uio.no/ci/job/Dhis2%20Web%20Trunk/ws/dhis-2/dhis-web/dhis-web-dashboard-integration/target/dhis-web-dashboard-integration&gt;
[INFO] Copy webapp webResources to <http://dhis.uio.no/ci/job/Dhis2%20Web%20Trunk/ws/dhis-2/dhis-web/dhis-web-dashboard-integration/target/dhis-web-dashboard-integration&gt;
[INFO] Building jar: <http://dhis.uio.no/ci/job/Dhis2%20Web%20Trunk/ws/dhis-2/dhis-web/dhis-web-dashboard-integration/target/dhis-web-dashboard-integration/WEB-INF/lib/dhis-web-dashboard-integration.jar&gt;
[INFO] Expanding: <DHIS2 App Hub; into <http://dhis.uio.no/ci/job/Dhis2%20Web%20Trunk/ws/dhis-2/dhis-web/dhis-web-dashboard-integration/target/war/work/dhis-web-commons-resources-2.2-SNAPSHOT&gt;
[INFO] Overlaying 1 war(s).
[INFO] Generating war <http://dhis.uio.no/ci/job/Dhis2%20Web%20Trunk/ws/dhis-2/dhis-web/dhis-web-dashboard-integration/target/dhis-web-dashboard-integration.war&gt;
[INFO] Building war: <http://dhis.uio.no/ci/job/Dhis2%20Web%20Trunk/ws/dhis-2/dhis-web/dhis-web-dashboard-integration/target/dhis-web-dashboard-integration.war&gt;
[HUDSON] Archiving <http://dhis.uio.no/ci/job/Dhis2%20Web%20Trunk/ws/dhis-2/dhis-web/dhis-web-dashboard-integration/pom.xml&gt; to /ifi/utgard/p01/dhis/projects/dhis-dev.ifi.uio.no/ci/home/jobs/Dhis2 Web Trunk/modules/org.hisp.dhis$dhis-web-dashboard-integration/builds/2011-03-29_06-16-48/archive/org.hisp.dhis/dhis-web-dashboard-integration/2.2-SNAPSHOT/pom.xml
[INFO] ------------------------------------------------------------------------
[ERROR] BUILD ERROR
[INFO] ------------------------------------------------------------------------
[INFO] Error assembling WAR: Problem creating war: Disk quota exceeded

[INFO] ------------------------------------------------------------------------
[INFO] For more information, run Maven with the -e switch
[INFO] ------------------------------------------------------------------------
[INFO] Total time: 14 minutes 12 seconds
[INFO] Finished at: Tue Mar 29 06:31:07 CEST 2011
[INFO] Final Memory: 188M/449M
[INFO] ------------------------------------------------------------------------
Sending e-mails to: dhis2-devs@lists.launchpad.net
channel stopped
Archiving artifacts
Performing Post build task...
Could not match :DHIS Web Portal ....................................... SUCCESS : False
Logical operation result is FALSE
Skipping script : echo "Building webapp succeeded. Deploying to dev"
/ifi/utgard/p01/dhis/bin/redeploy-dhis-snapshot
END OF POST BUILD TASK : 0
Failed to send e-mail to Tran Chau because no e-mail address is known, and no default e-mail domain is configured

See <DHIS2 App Hub;