Build failed in Jenkins: Dhis2 Web Trunk #2153

See <http://dhis.uio.no/ci/job/Dhis2%20Web%20Trunk/2153/changes>

Changes:

[Jan Henrik Overland] Improved code.

···

------------------------------------------
[...truncated 993 lines...]
[INFO] No tests to run.
[INFO] [war:war {execution: default-war}]
[INFO] Exploding webapp...
[INFO] Assembling webapp dhis-web-dashboard-integration in <http://dhis.uio.no/ci/job/Dhis2%20Web%20Trunk/ws/dhis-2/dhis-web/dhis-web-dashboard-integration/target/dhis-web-dashboard-integration>
[INFO] Copy webapp webResources to <http://dhis.uio.no/ci/job/Dhis2%20Web%20Trunk/ws/dhis-2/dhis-web/dhis-web-dashboard-integration/target/dhis-web-dashboard-integration>
[INFO] Building jar: <http://dhis.uio.no/ci/job/Dhis2%20Web%20Trunk/ws/dhis-2/dhis-web/dhis-web-dashboard-integration/target/dhis-web-dashboard-integration/WEB-INF/lib/dhis-web-dashboard-integration.jar>
[INFO] Expanding: <http://dhis.uio.no/ci/job/Dhis2%20Web%20Trunk/ws/dhis-2/dhis-web/dhis-web-commons-resources/target/dhis-web-commons-resources-2.2-SNAPSHOT.war> into <http://dhis.uio.no/ci/job/Dhis2%20Web%20Trunk/ws/dhis-2/dhis-web/dhis-web-dashboard-integration/target/war/work/dhis-web-commons-resources-2.2-SNAPSHOT>
[INFO] Overlaying 1 war(s).
[INFO] Generating war <http://dhis.uio.no/ci/job/Dhis2%20Web%20Trunk/ws/dhis-2/dhis-web/dhis-web-dashboard-integration/target/dhis-web-dashboard-integration.war>
[INFO] Building war: <http://dhis.uio.no/ci/job/Dhis2%20Web%20Trunk/ws/dhis-2/dhis-web/dhis-web-dashboard-integration/target/dhis-web-dashboard-integration.war>
[INFO] [install:install {execution: default-install}]
[INFO] Installing <http://dhis.uio.no/ci/job/Dhis2%20Web%20Trunk/ws/dhis-2/dhis-web/dhis-web-dashboard-integration/target/dhis-web-dashboard-integration.war> to /ifi/utgard/p01/dhis/.m2/repository/org/hisp/dhis/dhis-web-dashboard-integration/2.2-SNAPSHOT/dhis-web-dashboard-integration-2.2-SNAPSHOT.war
[INFO] Preparing findbugs:findbugs
[HUDSON] Archiving <http://dhis.uio.no/ci/job/Dhis2%20Web%20Trunk/ws/dhis-2/dhis-web/dhis-web-dashboard-integration/pom.xml> to /ifi/utgard/p01/dhis/projects/dhis-dev.ifi.uio.no/ci/home/jobs/Dhis2 Web Trunk/modules/org.hisp.dhis$dhis-web-dashboard-integration/builds/2011-03-14_17-46-33/archive/org.hisp.dhis/dhis-web-dashboard-integration/2.2-SNAPSHOT/pom.xml
[HUDSON] Archiving <http://dhis.uio.no/ci/job/Dhis2%20Web%20Trunk/ws/dhis-2/dhis-web/dhis-web-dashboard-integration/target/dhis-web-dashboard-integration.war> to /ifi/utgard/p01/dhis/projects/dhis-dev.ifi.uio.no/ci/home/jobs/Dhis2 Web Trunk/modules/org.hisp.dhis$dhis-web-dashboard-integration/builds/2011-03-14_17-46-33/archive/org.hisp.dhis/dhis-web-dashboard-integration/2.2-SNAPSHOT/dhis-web-dashboard-integration.war
[INFO] [resources:resources {execution: default-resources}]
[INFO] Using encoding: 'UTF-8' to copy filtered resources.
[INFO] [compiler:compile {execution: default-compile}]
[INFO] Nothing to compile - all classes are up to date
[INFO] [findbugs:findbugs {execution: default-cli}]
[INFO] Using source root:
[INFO] <http://dhis.uio.no/ci/job/Dhis2%20Web%20Trunk/ws/dhis-2/dhis-web/dhis-web-dashboard-integration/target/classes>
[INFO] Using test source root:
[INFO] <http://dhis.uio.no/ci/job/Dhis2%20Web%20Trunk/ws/dhis-2/dhis-web/dhis-web-dashboard-integration/target/test-classes>
[INFO] No effort provided, using default effort.
[INFO] Adding Source Directory: <http://dhis.uio.no/ci/job/Dhis2%20Web%20Trunk/ws/dhis-2/dhis-web/dhis-web-dashboard-integration/src/main/java>
[INFO] No threshold provided, using default threshold.
[INFO] Using FindBugs Version: 1.3.8
[INFO] No threshold provided, using default threshold.
[INFO] No threshold provided, using default threshold.
[INFO] No threshold provided, using default threshold.
[INFO] Using the xdoc format
[INFO] No effort provided, using default effort.
[INFO] No threshold provided, using default threshold.
[INFO] No threshold provided, using default threshold.
[INFO] Debugging is Off
[INFO] No bug include filter.
[INFO] Using bug exclude filter /tmp/plexus-resources1175196863tmp
[INFO] Printing Errors
[INFO] Printing Missing classes
[INFO] Printing Source Roots
[FINDBUGS] Successfully parsed file <http://dhis.uio.no/ci/job/Dhis2%20Web%20Trunk/ws/dhis-2/dhis-web/dhis-web-dashboard-integration/target/findbugsXml.xml> of module DHIS Web Dashboard Integration module with 1 warnings.
[INFO] ------------------------------------------------------------------------
[INFO] Building DHIS Case Entry
[INFO] task-segment: [clean, install, findbugs:findbugs]
[INFO] ------------------------------------------------------------------------
[INFO] [clean:clean {execution: default-clean}]
[INFO] Deleting directory <http://dhis.uio.no/ci/job/Dhis2%20Web%20Trunk/ws/dhis-2/dhis-web/dhis-web-caseentry/target>
[INFO] [resources:resources {execution: default-resources}]
[INFO] Using encoding: 'UTF-8' to copy filtered resources.
[INFO] [compiler:compile {execution: default-compile}]
[INFO] Compiling 36 source files to <http://dhis.uio.no/ci/job/Dhis2%20Web%20Trunk/ws/dhis-2/dhis-web/dhis-web-caseentry/target/classes>
[INFO] [resources:testResources {execution: default-testResources}]
[INFO] Using encoding: 'UTF-8' to copy filtered resources.
[INFO] [compiler:testCompile {execution: default-testCompile}]
[INFO] No sources to compile
[INFO] [surefire:test {execution: default-test}]
[INFO] No tests to run.
[HUDSON] Recording test results
[INFO] [war:war {execution: default-war}]
[INFO] Exploding webapp...
[INFO] Assembling webapp dhis-web-caseentry in <http://dhis.uio.no/ci/job/Dhis2%20Web%20Trunk/ws/dhis-2/dhis-web/dhis-web-caseentry/target/dhis-web-caseentry>
[INFO] Copy webapp webResources to <http://dhis.uio.no/ci/job/Dhis2%20Web%20Trunk/ws/dhis-2/dhis-web/dhis-web-caseentry/target/dhis-web-caseentry>
[INFO] Building jar: <http://dhis.uio.no/ci/job/Dhis2%20Web%20Trunk/ws/dhis-2/dhis-web/dhis-web-caseentry/target/dhis-web-caseentry/WEB-INF/lib/dhis-web-caseentry.jar>
[INFO] Expanding: <http://dhis.uio.no/ci/job/Dhis2%20Web%20Trunk/ws/dhis-2/dhis-web/dhis-web-commons-resources/target/dhis-web-commons-resources-2.2-SNAPSHOT.war> into <http://dhis.uio.no/ci/job/Dhis2%20Web%20Trunk/ws/dhis-2/dhis-web/dhis-web-caseentry/target/war/work/dhis-web-commons-resources-2.2-SNAPSHOT>
[INFO] Overlaying 1 war(s).
[INFO] Generating war <http://dhis.uio.no/ci/job/Dhis2%20Web%20Trunk/ws/dhis-2/dhis-web/dhis-web-caseentry/target/dhis-web-caseentry.war>
[INFO] Building war: <http://dhis.uio.no/ci/job/Dhis2%20Web%20Trunk/ws/dhis-2/dhis-web/dhis-web-caseentry/target/dhis-web-caseentry.war>
[INFO] [install:install {execution: default-install}]
[INFO] Installing <http://dhis.uio.no/ci/job/Dhis2%20Web%20Trunk/ws/dhis-2/dhis-web/dhis-web-caseentry/target/dhis-web-caseentry.war> to /ifi/utgard/p01/dhis/.m2/repository/org/hisp/dhis/dhis-web-caseentry/2.2-SNAPSHOT/dhis-web-caseentry-2.2-SNAPSHOT.war
[INFO] Preparing findbugs:findbugs
[HUDSON] Archiving <http://dhis.uio.no/ci/job/Dhis2%20Web%20Trunk/ws/dhis-2/dhis-web/dhis-web-caseentry/pom.xml> to /ifi/utgard/p01/dhis/projects/dhis-dev.ifi.uio.no/ci/home/jobs/Dhis2 Web Trunk/modules/org.hisp.dhis$dhis-web-caseentry/builds/2011-03-14_17-46-33/archive/org.hisp.dhis/dhis-web-caseentry/2.2-SNAPSHOT/pom.xml
[HUDSON] Archiving <http://dhis.uio.no/ci/job/Dhis2%20Web%20Trunk/ws/dhis-2/dhis-web/dhis-web-caseentry/target/dhis-web-caseentry.war> to /ifi/utgard/p01/dhis/projects/dhis-dev.ifi.uio.no/ci/home/jobs/Dhis2 Web Trunk/modules/org.hisp.dhis$dhis-web-caseentry/builds/2011-03-14_17-46-33/archive/org.hisp.dhis/dhis-web-caseentry/2.2-SNAPSHOT/dhis-web-caseentry.war
[INFO] [resources:resources {execution: default-resources}]
[INFO] Using encoding: 'UTF-8' to copy filtered resources.
[INFO] [compiler:compile {execution: default-compile}]
[INFO] Nothing to compile - all classes are up to date
[INFO] [findbugs:findbugs {execution: default-cli}]
[INFO] Using source root:
[INFO] <http://dhis.uio.no/ci/job/Dhis2%20Web%20Trunk/ws/dhis-2/dhis-web/dhis-web-caseentry/target/classes>
[INFO] Using test source root:
[INFO] <http://dhis.uio.no/ci/job/Dhis2%20Web%20Trunk/ws/dhis-2/dhis-web/dhis-web-caseentry/target/test-classes>
[INFO] No effort provided, using default effort.
[INFO] Adding Source Directory: <http://dhis.uio.no/ci/job/Dhis2%20Web%20Trunk/ws/dhis-2/dhis-web/dhis-web-caseentry/src/main/java>
[INFO] No threshold provided, using default threshold.
[INFO] Using FindBugs Version: 1.3.8
[INFO] No threshold provided, using default threshold.
[INFO] No threshold provided, using default threshold.
[INFO] No threshold provided, using default threshold.
[INFO] Using the xdoc format
[INFO] No effort provided, using default effort.
[INFO] No threshold provided, using default threshold.
[INFO] No threshold provided, using default threshold.
[INFO] Debugging is Off
[INFO] No bug include filter.
[INFO] Using bug exclude filter /tmp/plexus-resources692726312tmp
[FINDBUGS] Skipping file DHIS Case Entry of module <http://dhis.uio.no/ci/job/Dhis2%20Web%20Trunk/ws/dhis-2/dhis-web/dhis-web-caseentry/target/findbugsXml.xml> because it's empty.
[INFO] Printing Errors
[INFO] Printing Missing classes
[INFO] Printing Source Roots
[HUDSON] Re-archiving <http://dhis.uio.no/ci/job/Dhis2%20Web%20Trunk/ws/dhis-2/dhis-web/dhis-web-caseentry/target/dhis-web-caseentry.war>
[INFO] ------------------------------------------------------------------------
[INFO] Building DHIS Web API
[INFO] task-segment: [clean, install, findbugs:findbugs]
[INFO] ------------------------------------------------------------------------
[INFO] [clean:clean {execution: default-clean}]
[INFO] Deleting directory <http://dhis.uio.no/ci/job/Dhis2%20Web%20Trunk/ws/dhis-2/dhis-web/dhis-web-api/target>
[INFO] [resources:resources {execution: default-resources}]
[INFO] Using encoding: 'UTF-8' to copy filtered resources.
[INFO] [compiler:compile {execution: default-compile}]
[INFO] Compiling 50 source files to <http://dhis.uio.no/ci/job/Dhis2%20Web%20Trunk/ws/dhis-2/dhis-web/dhis-web-api/target/classes>
[INFO] [resources:testResources {execution: default-testResources}]
[INFO] Using encoding: 'UTF-8' to copy filtered resources.
[INFO] [compiler:testCompile {execution: default-testCompile}]
[INFO] Compiling 3 source files to <http://dhis.uio.no/ci/job/Dhis2%20Web%20Trunk/ws/dhis-2/dhis-web/dhis-web-api/target/test-classes>
[INFO] [surefire:test {execution: default-test}]
[INFO] Surefire report directory: <http://dhis.uio.no/ci/job/Dhis2%20Web%20Trunk/ws/dhis-2/dhis-web/dhis-web-api/target/surefire-reports>

-------------------------------------------------------
T E S T S
-------------------------------------------------------
Running org.hisp.dhis.web.api.provider.DataStreamSerializableProviderTest
Tests run: 1, Failures: 0, Errors: 0, Skipped: 0, Time elapsed: 0.106 sec
Running org.hisp.dhis.web.api.model.OrgUnitTest
Tests run: 1, Failures: 0, Errors: 0, Skipped: 0, Time elapsed: 0.01 sec
Running org.hisp.dhis.web.api.model.OrgUnitsTest
Tests run: 1, Failures: 0, Errors: 0, Skipped: 0, Time elapsed: 0.01 sec

Results :

Tests run: 3, Failures: 0, Errors: 0, Skipped: 0

[HUDSON] Recording test results
[INFO] [war:war {execution: default-war}]
[INFO] Exploding webapp...
[INFO] Assembling webapp dhis-web-api in <http://dhis.uio.no/ci/job/Dhis2%20Web%20Trunk/ws/dhis-2/dhis-web/dhis-web-api/target/dhis-web-api>
[INFO] Copy webapp webResources to <http://dhis.uio.no/ci/job/Dhis2%20Web%20Trunk/ws/dhis-2/dhis-web/dhis-web-api/target/dhis-web-api>
[INFO] Building jar: <http://dhis.uio.no/ci/job/Dhis2%20Web%20Trunk/ws/dhis-2/dhis-web/dhis-web-api/target/dhis-web-api/WEB-INF/lib/dhis-web-api.jar>
[INFO] Expanding: <http://dhis.uio.no/ci/job/Dhis2%20Web%20Trunk/ws/dhis-2/dhis-web/dhis-web-commons-resources/target/dhis-web-commons-resources-2.2-SNAPSHOT.war> into <http://dhis.uio.no/ci/job/Dhis2%20Web%20Trunk/ws/dhis-2/dhis-web/dhis-web-api/target/war/work/dhis-web-commons-resources-2.2-SNAPSHOT>
[INFO] Overlaying 1 war(s).
[INFO] Generating war <http://dhis.uio.no/ci/job/Dhis2%20Web%20Trunk/ws/dhis-2/dhis-web/dhis-web-api/target/dhis-web-api.war>
[INFO] Building war: <http://dhis.uio.no/ci/job/Dhis2%20Web%20Trunk/ws/dhis-2/dhis-web/dhis-web-api/target/dhis-web-api.war>
[HUDSON] Archiving <http://dhis.uio.no/ci/job/Dhis2%20Web%20Trunk/ws/dhis-2/dhis-web/dhis-web-api/pom.xml> to /ifi/utgard/p01/dhis/projects/dhis-dev.ifi.uio.no/ci/home/jobs/Dhis2 Web Trunk/modules/org.hisp.dhis$dhis-web-api/builds/2011-03-14_17-46-33/archive/org.hisp.dhis/dhis-web-api/2.2-SNAPSHOT/pom.xml
[INFO] ------------------------------------------------------------------------
[ERROR] BUILD ERROR
[INFO] ------------------------------------------------------------------------
[INFO] Error assembling WAR: Problem creating war: Disk quota exceeded

[INFO] ------------------------------------------------------------------------
[INFO] For more information, run Maven with the -e switch
[INFO] ------------------------------------------------------------------------
[INFO] Total time: 14 minutes 55 seconds
[INFO] Finished at: Mon Mar 14 18:01:35 CET 2011
[INFO] Final Memory: 217M/519M
[INFO] ------------------------------------------------------------------------
ERROR: Asynchronous execution failure
java.util.concurrent.ExecutionException: java.io.IOException: Disk quota exceeded
  at hudson.remoting.Channel$2.adapt(Channel.java:662)
  at hudson.remoting.Channel$2.adapt(Channel.java:657)
  at hudson.remoting.FutureAdapter.get(FutureAdapter.java:55)
  at hudson.maven.MavenBuilder.call(MavenBuilder.java:175)
  at hudson.maven.MavenModuleSetBuild$Builder.call(MavenModuleSetBuild.java:868)
  at hudson.maven.MavenModuleSetBuild$Builder.call(MavenModuleSetBuild.java:799)
  at hudson.remoting.UserRequest.perform(UserRequest.java:114)
  at hudson.remoting.UserRequest.perform(UserRequest.java:48)
  at hudson.remoting.Request$2.run(Request.java:270)
  at java.util.concurrent.Executors$RunnableAdapter.call(Executors.java:441)
  at java.util.concurrent.FutureTask$Sync.innerRun(FutureTask.java:303)
  at java.util.concurrent.FutureTask.run(FutureTask.java:138)
  at java.util.concurrent.ThreadPoolExecutor$Worker.runTask(ThreadPoolExecutor.java:886)
  at java.util.concurrent.ThreadPoolExecutor$Worker.run(ThreadPoolExecutor.java:908)
  at java.lang.Thread.run(Thread.java:662)
Caused by: java.io.IOException: Disk quota exceeded
  at java.io.FileOutputStream.close0(Native Method)
  at java.io.FileOutputStream.close(FileOutputStream.java:279)
  at sun.nio.cs.StreamEncoder.implClose(StreamEncoder.java:301)
  at sun.nio.cs.StreamEncoder.close(StreamEncoder.java:130)
  at java.io.OutputStreamWriter.close(OutputStreamWriter.java:216)
  at java.io.BufferedWriter.close(BufferedWriter.java:248)
  at hudson.util.AtomicFileWriter.close(AtomicFileWriter.java:94)
  at hudson.util.AtomicFileWriter.commit(AtomicFileWriter.java:109)
  at hudson.XmlFile.write(XmlFile.java:166)
  at hudson.model.Fingerprint.save(Fingerprint.java:704)
  at hudson.model.Fingerprint.add(Fingerprint.java:666)
  at hudson.model.Fingerprint.add(Fingerprint.java:651)
  at hudson.maven.reporters.MavenFingerprinter$1.call(MavenFingerprinter.java:107)
  at hudson.maven.reporters.MavenFingerprinter$1.call(MavenFingerprinter.java:96)
  at hudson.maven.MavenBuild$ProxyImpl.execute(MavenBuild.java:379)
  at hudson.maven.MavenBuild$ProxyImpl2.execute(MavenBuild.java:452)
  at sun.reflect.GeneratedMethodAccessor167.invoke(Unknown Source)
  at sun.reflect.DelegatingMethodAccessorImpl.invoke(DelegatingMethodAccessorImpl.java:25)
  at java.lang.reflect.Method.invoke(Method.java:597)
  at hudson.model.Executor$1.call(Executor.java:429)
  at hudson.util.InterceptingProxy$1.invoke(InterceptingProxy.java:23)
  at $Proxy30.execute(Unknown Source)
  at hudson.maven.MavenBuildProxy$Filter$AsyncInvoker.call(MavenBuildProxy.java:263)
  ... 9 more
ERROR: Asynchronous execution failure
java.util.concurrent.ExecutionException: java.io.IOException: Disk quota exceeded
  at hudson.remoting.Channel$2.adapt(Channel.java:662)
  at hudson.remoting.Channel$2.adapt(Channel.java:657)
  at hudson.remoting.FutureAdapter.get(FutureAdapter.java:55)
  at hudson.maven.MavenBuilder.call(MavenBuilder.java:175)
  at hudson.maven.MavenModuleSetBuild$Builder.call(MavenModuleSetBuild.java:868)
  at hudson.maven.MavenModuleSetBuild$Builder.call(MavenModuleSetBuild.java:799)
  at hudson.remoting.UserRequest.perform(UserRequest.java:114)
  at hudson.remoting.UserRequest.perform(UserRequest.java:48)
  at hudson.remoting.Request$2.run(Request.java:270)
  at java.util.concurrent.Executors$RunnableAdapter.call(Executors.java:441)
  at java.util.concurrent.FutureTask$Sync.innerRun(FutureTask.java:303)
  at java.util.concurrent.FutureTask.run(FutureTask.java:138)
  at java.util.concurrent.ThreadPoolExecutor$Worker.runTask(ThreadPoolExecutor.java:886)
  at java.util.concurrent.ThreadPoolExecutor$Worker.run(ThreadPoolExecutor.java:908)
  at java.lang.Thread.run(Thread.java:662)
Caused by: java.io.IOException: Disk quota exceeded
  at java.io.FileOutputStream.close0(Native Method)
  at java.io.FileOutputStream.close(FileOutputStream.java:279)
  at sun.nio.cs.StreamEncoder.implClose(StreamEncoder.java:301)
  at sun.nio.cs.StreamEncoder.close(StreamEncoder.java:130)
  at java.io.OutputStreamWriter.close(OutputStreamWriter.java:216)
  at java.io.BufferedWriter.close(BufferedWriter.java:248)
  at hudson.util.AtomicFileWriter.close(AtomicFileWriter.java:94)
  at hudson.util.AtomicFileWriter.commit(AtomicFileWriter.java:109)
  at hudson.XmlFile.write(XmlFile.java:166)
  at hudson.model.Fingerprint.save(Fingerprint.java:704)
  at hudson.model.Fingerprint.add(Fingerprint.java:666)
  at hudson.model.Fingerprint.add(Fingerprint.java:651)
  at hudson.maven.reporters.MavenFingerprinter$1.call(MavenFingerprinter.java:105)
  at hudson.maven.reporters.MavenFingerprinter$1.call(MavenFingerprinter.java:96)
  at hudson.maven.MavenBuild$ProxyImpl.execute(MavenBuild.java:379)
  at hudson.maven.MavenBuild$ProxyImpl2.execute(MavenBuild.java:452)
  at sun.reflect.GeneratedMethodAccessor167.invoke(Unknown Source)
  at sun.reflect.DelegatingMethodAccessorImpl.invoke(DelegatingMethodAccessorImpl.java:25)
  at java.lang.reflect.Method.invoke(Method.java:597)
  at hudson.model.Executor$1.call(Executor.java:429)
  at hudson.util.InterceptingProxy$1.invoke(InterceptingProxy.java:23)
  at $Proxy30.execute(Unknown Source)
  at hudson.maven.MavenBuildProxy$Filter$AsyncInvoker.call(MavenBuildProxy.java:263)
  ... 9 more
Sending e-mails to: dhis2-devs@lists.launchpad.net
channel stopped
Archiving artifacts
Performing Post build task...
Could not match :DHIS Web Portal ....................................... SUCCESS : False
Logical operation result is FALSE
Skipping script : echo "Building webapp succeeded. Deploying to dev"
/ifi/utgard/p01/dhis/bin/redeploy-dhis-snapshot
END OF POST BUILD TASK : 0
Failed to send e-mail to Jan Henrik Overland because no e-mail address is known, and no default e-mail domain is configured

See <http://dhis.uio.no/ci/job/Dhis2%20Web%20Trunk/2154/changes>