Build failed in Jenkins: Dhis2 Service Trunk #2753

See <http://dhis.uio.no/ci/job/Dhis2%20Service%20Trunk/2753/changes>

Changes:

[Lars Helge Overland] Removed unnecessary cascading from OrganisationUnit-parent and DataSet-Section associations

···

------------------------------------------
Started by an SCM change
$ bzr revision-info -d "<http://dhis.uio.no/ci/job/Dhis2%20Service%20Trunk/ws/">
info result: bzr revision-info -d <http://dhis.uio.no/ci/job/Dhis2%20Service%20Trunk/ws/> returned 0. Command output: "3771 larshelge@gmail.com-20110527145001-iro2b8pw2s8iw2hc
" stderr: ""
ERROR: Ignore Problem expanding maven opts macros org.jenkinsci.plugins.tokenmacro.TokenMacro
[workspace] $ bzr pull --overwrite https://code.launchpad.net/~dhis2-devs-core/dhis2/trunk
M dhis-2/dhis-services/dhis-service-core/src/main/java/org/hisp/dhis/dataset/DataSetDeletionHandler.java
M dhis-2/dhis-services/dhis-service-core/src/main/resources/org/hisp/dhis/dataset/hibernate/DataSet.hbm.xml
M dhis-2/dhis-services/dhis-service-core/src/main/resources/org/hisp/dhis/organisationunit/hibernate/OrganisationUnit.hbm.xml
M dhis-2/dhis-support/dhis-support-hibernate/src/main/resources/ehcache.xml
M dhis-2/dhis-web/dhis-web-maintenance/dhis-web-maintenance-dataset/src/main/java/org/hisp/dhis/dataset/action/section/AddSectionAction.java
M dhis-2/dhis-web/dhis-web-maintenance/dhis-web-maintenance-dataset/src/main/java/org/hisp/dhis/dataset/action/section/RemoveSectionAction.java
All changes applied successfully.
Now on revision 3772.
$ bzr revision-info -d "<http://dhis.uio.no/ci/job/Dhis2%20Service%20Trunk/ws/">
info result: bzr revision-info -d <http://dhis.uio.no/ci/job/Dhis2%20Service%20Trunk/ws/> returned 0. Command output: "3772 larshelge@gmail.com-20110528115754-kdnvpzjwa04s7mjy
" stderr: ""
[workspace] $ bzr log -v -r revid:larshelge@gmail.com-20110527145001-iro2b8pw2s8iw2hc..revid:larshelge@gmail.com-20110528115754-kdnvpzjwa04s7mjy --long --show-ids
Getting local revision...
$ bzr revision-info -d "<http://dhis.uio.no/ci/job/Dhis2%20Service%20Trunk/ws/">
info result: bzr revision-info -d <http://dhis.uio.no/ci/job/Dhis2%20Service%20Trunk/ws/> returned 0. Command output: "3772 larshelge@gmail.com-20110528115754-kdnvpzjwa04s7mjy
" stderr: ""
RevisionState revno:3772 revid:larshelge@gmail.com-20110528115754-kdnvpzjwa04s7mjy
ERROR: Ignore Problem expanding maven opts macros org.jenkinsci.plugins.tokenmacro.TokenMacro
Found mavenVersion 2.2.1 from file jar:file:/projects/hisp/jenkins_home/tools/2.2.1/lib/maven-2.2.1-uber.jar!/META-INF/maven/org.apache.maven/maven-core/pom.properties
Parsing POMs
ERROR: Ignore Problem expanding maven opts macros org.jenkinsci.plugins.tokenmacro.TokenMacro
[dhis-2] $ /local/opt/j2sdk/bin/java -Xmx2048m -XX:MaxPermSize=512m -cp /projects/hisp/jenkins_home/plugins/maven-plugin/WEB-INF/lib/maven-agent-1.1.jar:/projects/hisp/jenkins_home/tools/2.2.1/boot/classworlds-1.1.jar hudson.maven.agent.Main /projects/hisp/jenkins_home/tools/2.2.1 /ifi/utgard/p01/dhis/projects/dhis-1.ifi.uio.no/ci/tomcat/webapps/ci/WEB-INF/lib/remoting-1.409.jar /projects/hisp/jenkins_home/plugins/maven-plugin/WEB-INF/lib/maven-interceptor-1.1.jar 51074 /projects/hisp/jenkins_home/plugins/maven-plugin/WEB-INF/lib/maven2.1-interceptor-1.2.jar
<===[HUDSON REMOTING CAPACITY]===> channel started
Executing Maven: -B -f <http://dhis.uio.no/ci/job/Dhis2%20Service%20Trunk/ws/dhis-2/pom.xml> clean install findbugs:findbugs
[INFO] Scanning for projects...
[INFO] Reactor build order:
[INFO] DHIS 2
[INFO] DHIS API
[INFO] DHIS Support Parent Project
[INFO] DHIS Test Support
[INFO] DHIS External Support
[INFO] DHIS Hibernate Support
[INFO] DHIS System Support
[INFO] DHIS JDBC Service
[INFO] DHIS XML framework services
[INFO] DHIS Services Parent Project
[INFO] DHIS Core API Implementations
[INFO] DHIS I18n Static
[INFO] DHIS Options
[INFO] DHIS Administration Service
[INFO] DHIS DataMart Service - Default
[INFO] DHIS Aggregation Service - Default
[INFO] DHIS OrganisationUnit API Implementations
[INFO] DHIS Reporting Service
[INFO] DHIS Import-Export Service
[INFO] DHIS Patient API Implementations
[INFO] DHIS JDBC / External Test Project
[INFO] ------------------------------------------------------------------------
[INFO] Building DHIS 2
[INFO] task-segment: [clean, install, findbugs:findbugs]
[INFO] ------------------------------------------------------------------------
[INFO] [clean:clean {execution: default-clean}]
[INFO] [site:attach-descriptor {execution: default-attach-descriptor}]
[INFO] [install:install {execution: default-install}]
[INFO] Installing <http://dhis.uio.no/ci/job/Dhis2%20Service%20Trunk/ws/dhis-2/pom.xml> to /ifi/utgard/p01/dhis/.m2/repository/org/hisp/dhis/dhis/2.3-SNAPSHOT/dhis-2.3-SNAPSHOT.pom
[INFO] Preparing findbugs:findbugs
[INFO] No goals needed for project - skipping
[INFO] Setting property: classpath.resource.loader.class => 'org.codehaus.plexus.velocity.ContextClassLoaderResourceLoader'.
[INFO] Setting property: velocimacro.messages.on => 'false'.
[INFO] Setting property: resource.loader => 'classpath'.
[INFO] Setting property: resource.manager.logwhenfound => 'false'.
[INFO] **************************************************************
[INFO] Starting Jakarta Velocity v1.4
[INFO] RuntimeInstance initializing.
[INFO] Default Properties File: org/apache/velocity/runtime/defaults/velocity.properties
[INFO] Default ResourceManager initializing. (class org.apache.velocity.runtime.resource.ResourceManagerImpl)
[INFO] Resource Loader Instantiated: org.codehaus.plexus.velocity.ContextClassLoaderResourceLoader
[INFO] ClasspathResourceLoader : initialization starting.
[INFO] ClasspathResourceLoader : initialization complete.
[INFO] ResourceCache : initialized. (class org.apache.velocity.runtime.resource.ResourceCacheImpl)
[INFO] Default ResourceManager initialization complete.
[INFO] Loaded System Directive: org.apache.velocity.runtime.directive.Literal
[INFO] Loaded System Directive: org.apache.velocity.runtime.directive.Macro
[INFO] Loaded System Directive: org.apache.velocity.runtime.directive.Parse
[INFO] Loaded System Directive: org.apache.velocity.runtime.directive.Include
[INFO] Loaded System Directive: org.apache.velocity.runtime.directive.Foreach
[INFO] Created: 20 parsers.
[INFO] Velocimacro : initialization starting.
[INFO] Velocimacro : adding VMs from VM library template : VM_global_library.vm
[ERROR] ResourceManager : unable to find resource 'VM_global_library.vm' in any resource loader.
[INFO] Velocimacro : error using VM library template VM_global_library.vm : org.apache.velocity.exception.ResourceNotFoundException: Unable to find resource 'VM_global_library.vm'
[INFO] Velocimacro : VM library template macro registration complete.
[INFO] Velocimacro : allowInline = true : VMs can be defined inline in templates
[INFO] Velocimacro : allowInlineToOverride = false : VMs defined inline may NOT replace previous VM definitions
[INFO] Velocimacro : allowInlineLocal = false : VMs defined inline will be global in scope if allowed.
[INFO] Velocimacro : initialization complete.
[INFO] Velocity successfully started.
[INFO] [findbugs:findbugs {execution: default-cli}]
[INFO] Using source root:
[INFO] <http://dhis.uio.no/ci/job/Dhis2%20Service%20Trunk/ws/dhis-2/target/classes>
[INFO] Using test source root:
[INFO] <http://dhis.uio.no/ci/job/Dhis2%20Service%20Trunk/ws/dhis-2/target/test-classes>
[INFO] Output class directory doesn't exist. Skipping findbugs.
[JENKINS] Archiving <http://dhis.uio.no/ci/job/Dhis2%20Service%20Trunk/ws/dhis-2/pom.xml> to /projects/hisp/jenkins_home/jobs/Dhis2 Service Trunk/modules/org.hisp.dhis$dhis/builds/2011-05-28_14-01-54/archive/org.hisp.dhis/dhis/2.3-SNAPSHOT/dhis-2.3-SNAPSHOT.pom
[INFO] ------------------------------------------------------------------------
[INFO] Building DHIS API
[INFO] task-segment: [clean, install, findbugs:findbugs]
[INFO] ------------------------------------------------------------------------
[INFO] [clean:clean {execution: default-clean}]
[INFO] Deleting directory <http://dhis.uio.no/ci/job/Dhis2%20Service%20Trunk/ws/dhis-2/dhis-api/target>
[JENKINS] Archiving <http://dhis.uio.no/ci/job/Dhis2%20Service%20Trunk/ws/dhis-2/dhis-api/pom.xml> to /projects/hisp/jenkins_home/jobs/Dhis2 Service Trunk/modules/org.hisp.dhis$dhis-api/builds/2011-05-28_14-01-54/archive/org.hisp.dhis/dhis-api/2.3-SNAPSHOT/dhis-api-2.3-SNAPSHOT.pom
[INFO] ------------------------------------------------------------------------
[ERROR] FATAL ERROR
[INFO] ------------------------------------------------------------------------
[INFO] null
[INFO] ------------------------------------------------------------------------
[INFO] Trace
java.lang.NullPointerException
  at org.codehaus.plexus.util.DirectoryScanner.scandir(DirectoryScanner.java:677)
  at org.codehaus.plexus.util.DirectoryScanner.scandir(DirectoryScanner.java:727)
  at org.codehaus.plexus.util.DirectoryScanner.scandir(DirectoryScanner.java:727)
  at org.codehaus.plexus.util.DirectoryScanner.scandir(DirectoryScanner.java:727)
  at org.codehaus.plexus.util.DirectoryScanner.scandir(DirectoryScanner.java:727)
  at org.codehaus.plexus.util.DirectoryScanner.scandir(DirectoryScanner.java:727)
  at org.codehaus.plexus.util.DirectoryScanner.scan(DirectoryScanner.java:593)
  at org.apache.maven.shared.model.fileset.util.FileSetManager.scan(FileSetManager.java:659)
  at org.apache.maven.shared.model.fileset.util.FileSetManager.findDeletableFiles(FileSetManager.java:462)
  at org.apache.maven.shared.model.fileset.util.FileSetManager.findDeletablePaths(FileSetManager.java:366)
  at org.apache.maven.shared.model.fileset.util.FileSetManager.delete(FileSetManager.java:284)
  at org.apache.maven.plugin.clean.CleanMojo.removeDirectory(CleanMojo.java:261)
  at org.apache.maven.plugin.clean.CleanMojo.execute(CleanMojo.java:173)
  at org.apache.maven.plugin.DefaultPluginManager.executeMojo(DefaultPluginManager.java:490)
  at hudson.maven.agent.PluginManagerInterceptor.executeMojo(PluginManagerInterceptor.java:182)
  at org.apache.maven.lifecycle.DefaultLifecycleExecutor.executeGoals(DefaultLifecycleExecutor.java:694)
  at org.apache.maven.lifecycle.DefaultLifecycleExecutor.executeGoalWithLifecycle(DefaultLifecycleExecutor.java:556)
  at org.apache.maven.lifecycle.DefaultLifecycleExecutor.executeGoal(DefaultLifecycleExecutor.java:535)
  at org.apache.maven.lifecycle.DefaultLifecycleExecutor.executeGoalAndHandleFailures(DefaultLifecycleExecutor.java:387)
  at org.apache.maven.lifecycle.DefaultLifecycleExecutor.executeTaskSegments(DefaultLifecycleExecutor.java:348)
  at org.apache.maven.lifecycle.DefaultLifecycleExecutor.execute(DefaultLifecycleExecutor.java:180)
  at org.apache.maven.lifecycle.LifecycleExecutorInterceptor.execute(LifecycleExecutorInterceptor.java:65)
  at org.apache.maven.DefaultMaven.doExecute(DefaultMaven.java:328)
  at org.apache.maven.DefaultMaven.execute(DefaultMaven.java:138)
  at org.apache.maven.cli.MavenCli.main(MavenCli.java:362)
  at sun.reflect.NativeMethodAccessorImpl.invoke0(Native Method)
  at sun.reflect.NativeMethodAccessorImpl.invoke(NativeMethodAccessorImpl.java:39)
  at sun.reflect.DelegatingMethodAccessorImpl.invoke(DelegatingMethodAccessorImpl.java:25)
  at java.lang.reflect.Method.invoke(Method.java:597)
  at org.codehaus.classworlds.Launcher.launchEnhanced(Launcher.java:315)
  at org.codehaus.classworlds.Launcher.launch(Launcher.java:255)
  at hudson.maven.agent.Main.launch(Main.java:173)
  at hudson.maven.MavenBuilder.call(MavenBuilder.java:164)
  at hudson.maven.MavenModuleSetBuild$Builder.call(MavenModuleSetBuild.java:987)
  at hudson.maven.MavenModuleSetBuild$Builder.call(MavenModuleSetBuild.java:918)
  at hudson.remoting.UserRequest.perform(UserRequest.java:118)
  at hudson.remoting.UserRequest.perform(UserRequest.java:48)
  at hudson.remoting.Request$2.run(Request.java:270)
  at java.util.concurrent.Executors$RunnableAdapter.call(Executors.java:441)
  at java.util.concurrent.FutureTask$Sync.innerRun(FutureTask.java:303)
  at java.util.concurrent.FutureTask.run(FutureTask.java:138)
  at java.util.concurrent.ThreadPoolExecutor$Worker.runTask(ThreadPoolExecutor.java:886)
  at java.util.concurrent.ThreadPoolExecutor$Worker.run(ThreadPoolExecutor.java:908)
  at java.lang.Thread.run(Thread.java:662)
[INFO] ------------------------------------------------------------------------
[INFO] Total time: 29 seconds
[INFO] Finished at: Sat May 28 14:02:32 CEST 2011
[INFO] Final Memory: 27M/334M
[INFO] ------------------------------------------------------------------------
channel stopped

See <http://dhis.uio.no/ci/job/Dhis2%20Service%20Trunk/2754/changes>

Changes:

[Lars Helge Overland] Upgraded to hibernate 3.6.4

···

------------------------------------------
[...truncated 269 lines...]
[JENKINS] Archiving <http://dhis.uio.no/ci/job/Dhis2%20Service%20Trunk/ws/dhis-2/dhis-support/dhis-support-test/pom.xml> to /projects/hisp/jenkins_home/jobs/Dhis2 Service Trunk/modules/org.hisp.dhis$dhis-support-test/builds/2011-05-28_16-01-48/archive/org.hisp.dhis/dhis-support-test/2.3-SNAPSHOT/dhis-support-test-2.3-SNAPSHOT.pom
[JENKINS] Archiving <http://dhis.uio.no/ci/job/Dhis2%20Service%20Trunk/ws/dhis-2/dhis-support/dhis-support-test/target/dhis-support-test-2.3-SNAPSHOT.jar> to /projects/hisp/jenkins_home/jobs/Dhis2 Service Trunk/modules/org.hisp.dhis$dhis-support-test/builds/2011-05-28_16-01-48/archive/org.hisp.dhis/dhis-support-test/2.3-SNAPSHOT/dhis-support-test-2.3-SNAPSHOT.jar
[INFO] [resources:resources {execution: default-resources}]
[INFO] Using encoding: 'UTF-8' to copy filtered resources.
[INFO] [compiler:compile {execution: default-compile}]
[INFO] Nothing to compile - all classes are up to date
[INFO] [findbugs:findbugs {execution: default-cli}]
[INFO] Using source root:
[INFO] <http://dhis.uio.no/ci/job/Dhis2%20Service%20Trunk/ws/dhis-2/dhis-support/dhis-support-test/target/classes>
[INFO] Using test source root:
[INFO] <http://dhis.uio.no/ci/job/Dhis2%20Service%20Trunk/ws/dhis-2/dhis-support/dhis-support-test/target/test-classes>
[INFO] No effort provided, using default effort.
[INFO] Adding Source Directory: <http://dhis.uio.no/ci/job/Dhis2%20Service%20Trunk/ws/dhis-2/dhis-support/dhis-support-test/src/main/java>
[INFO] No threshold provided, using default threshold.
[INFO] Using FindBugs Version: 1.3.8
[INFO] No threshold provided, using default threshold.
[INFO] No threshold provided, using default threshold.
[INFO] No threshold provided, using default threshold.
[INFO] Using the xdoc format
[INFO] No effort provided, using default effort.
[INFO] No threshold provided, using default threshold.
[INFO] No threshold provided, using default threshold.
[INFO] Debugging is Off
[INFO] No bug include filter.
[INFO] Using bug exclude filter /tmp/plexus-resources1761391386tmp
[INFO] Printing Errors
[INFO] Printing Missing classes
[INFO] Printing Source Roots
[FINDBUGS] Successfully parsed file <http://dhis.uio.no/ci/job/Dhis2%20Service%20Trunk/ws/dhis-2/dhis-support/dhis-support-test/target/findbugsXml.xml> of module DHIS Test Support with 2 warnings.
[INFO] ------------------------------------------------------------------------
[INFO] Building DHIS External Support
[INFO] task-segment: [clean, install, findbugs:findbugs]
[INFO] ------------------------------------------------------------------------
[INFO] [clean:clean {execution: default-clean}]
[INFO] Deleting directory <http://dhis.uio.no/ci/job/Dhis2%20Service%20Trunk/ws/dhis-2/dhis-support/dhis-support-external/target>
[INFO] [resources:resources {execution: default-resources}]
[INFO] Using encoding: 'UTF-8' to copy filtered resources.
[INFO] [compiler:compile {execution: default-compile}]
[INFO] Compiling 3 source files to <http://dhis.uio.no/ci/job/Dhis2%20Service%20Trunk/ws/dhis-2/dhis-support/dhis-support-external/target/classes>
[INFO] [resources:testResources {execution: default-testResources}]
[INFO] Using encoding: 'UTF-8' to copy filtered resources.
[INFO] [compiler:testCompile {execution: default-testCompile}]
[INFO] No sources to compile
[WARNING] DEPRECATED [systemProperties]: Use systemPropertyVariables instead.
[INFO] [surefire:test {execution: default-test}]
[INFO] No tests to run.
[INFO] Surefire report directory: <http://dhis.uio.no/ci/job/Dhis2%20Service%20Trunk/ws/dhis-2/dhis-support/dhis-support-external/target/surefire-reports>

-------------------------------------------------------
T E S T S
-------------------------------------------------------
There are no tests to run.

Results :

Tests run: 0, Failures: 0, Errors: 0, Skipped: 0

[JENKINS] Recording test results
[INFO] [jar:jar {execution: default-jar}]
[INFO] Building jar: <http://dhis.uio.no/ci/job/Dhis2%20Service%20Trunk/ws/dhis-2/dhis-support/dhis-support-external/target/dhis-support-external-2.3-SNAPSHOT.jar>
[INFO] [install:install {execution: default-install}]
[INFO] Installing <http://dhis.uio.no/ci/job/Dhis2%20Service%20Trunk/ws/dhis-2/dhis-support/dhis-support-external/target/dhis-support-external-2.3-SNAPSHOT.jar> to /ifi/utgard/p01/dhis/.m2/repository/org/hisp/dhis/dhis-support-external/2.3-SNAPSHOT/dhis-support-external-2.3-SNAPSHOT.jar
[INFO] Preparing findbugs:findbugs
[JENKINS] Archiving <http://dhis.uio.no/ci/job/Dhis2%20Service%20Trunk/ws/dhis-2/dhis-support/dhis-support-external/pom.xml> to /projects/hisp/jenkins_home/jobs/Dhis2 Service Trunk/modules/org.hisp.dhis$dhis-support-external/builds/2011-05-28_16-01-48/archive/org.hisp.dhis/dhis-support-external/2.3-SNAPSHOT/dhis-support-external-2.3-SNAPSHOT.pom
[JENKINS] Archiving <http://dhis.uio.no/ci/job/Dhis2%20Service%20Trunk/ws/dhis-2/dhis-support/dhis-support-external/target/dhis-support-external-2.3-SNAPSHOT.jar> to /projects/hisp/jenkins_home/jobs/Dhis2 Service Trunk/modules/org.hisp.dhis$dhis-support-external/builds/2011-05-28_16-01-48/archive/org.hisp.dhis/dhis-support-external/2.3-SNAPSHOT/dhis-support-external-2.3-SNAPSHOT.jar
[INFO] [resources:resources {execution: default-resources}]
[INFO] Using encoding: 'UTF-8' to copy filtered resources.
[INFO] [compiler:compile {execution: default-compile}]
[INFO] Nothing to compile - all classes are up to date
[INFO] [findbugs:findbugs {execution: default-cli}]
[INFO] Using source root:
[INFO] <http://dhis.uio.no/ci/job/Dhis2%20Service%20Trunk/ws/dhis-2/dhis-support/dhis-support-external/target/classes>
[INFO] Using test source root:
[INFO] <http://dhis.uio.no/ci/job/Dhis2%20Service%20Trunk/ws/dhis-2/dhis-support/dhis-support-external/target/test-classes>
[INFO] No effort provided, using default effort.
[INFO] Adding Source Directory: <http://dhis.uio.no/ci/job/Dhis2%20Service%20Trunk/ws/dhis-2/dhis-support/dhis-support-external/src/main/java>
[INFO] No threshold provided, using default threshold.
[INFO] Using FindBugs Version: 1.3.8
[INFO] No threshold provided, using default threshold.
[INFO] No threshold provided, using default threshold.
[INFO] No threshold provided, using default threshold.
[INFO] Using the xdoc format
[INFO] No effort provided, using default effort.
[INFO] No threshold provided, using default threshold.
[INFO] No threshold provided, using default threshold.
[INFO] Debugging is Off
[INFO] No bug include filter.
[INFO] Using bug exclude filter /tmp/plexus-resources1381689573tmp
[INFO] Printing Errors
[INFO] Printing Missing classes
[INFO] Printing Source Roots
[FINDBUGS] Successfully parsed file <http://dhis.uio.no/ci/job/Dhis2%20Service%20Trunk/ws/dhis-2/dhis-support/dhis-support-external/target/findbugsXml.xml> of module DHIS External Support with 2 warnings.
[INFO] ------------------------------------------------------------------------
[INFO] Building DHIS Hibernate Support
[INFO] task-segment: [clean, install, findbugs:findbugs]
[INFO] ------------------------------------------------------------------------
[INFO] [clean:clean {execution: default-clean}]
[INFO] Deleting directory <http://dhis.uio.no/ci/job/Dhis2%20Service%20Trunk/ws/dhis-2/dhis-support/dhis-support-hibernate/target>
[INFO] [resources:resources {execution: default-resources}]
[INFO] Using encoding: 'UTF-8' to copy filtered resources.
Downloading: http://www.amplecode.org/maven2/org/hibernate/hibernate-ehcache/3.6.4.Final/hibernate-ehcache-3.6.4.Final.pom
[INFO] Unable to find resource 'org.hibernate:hibernate-ehcache:pom:3.6.4.Final' in repository amplecode_maven2_repo (http://www.amplecode.org/maven2)
Downloading: http://dhis.uio.no/maven/external/org/hibernate/hibernate-ehcache/3.6.4.Final/hibernate-ehcache-3.6.4.Final.pom
[INFO] Unable to find resource 'org.hibernate:hibernate-ehcache:pom:3.6.4.Final' in repository dhis.uio.no (http://dhis.uio.no/maven/external)
Downloading: http://repo1.maven.org/maven2/org/hibernate/hibernate-ehcache/3.6.4.Final/hibernate-ehcache-3.6.4.Final.pom

Downloading: http://www.amplecode.org/maven2/net/sf/ehcache/ehcache-core/2.4.1/ehcache-core-2.4.1.pom
[INFO] Unable to find resource 'net.sf.ehcache:ehcache-core:pom:2.4.1' in repository amplecode_maven2_repo (http://www.amplecode.org/maven2)
Downloading: http://dhis.uio.no/maven/external/net/sf/ehcache/ehcache-core/2.4.1/ehcache-core-2.4.1.pom
[INFO] Unable to find resource 'net.sf.ehcache:ehcache-core:pom:2.4.1' in repository dhis.uio.no (http://dhis.uio.no/maven/external)
Downloading: http://repo1.maven.org/maven2/net/sf/ehcache/ehcache-core/2.4.1/ehcache-core-2.4.1.pom

Downloading: http://www.amplecode.org/maven2/org/hibernate/hibernate-entitymanager/3.6.4.Final/hibernate-entitymanager-3.6.4.Final.pom
[INFO] Unable to find resource 'org.hibernate:hibernate-entitymanager:pom:3.6.4.Final' in repository amplecode_maven2_repo (http://www.amplecode.org/maven2)
Downloading: http://dhis.uio.no/maven/external/org/hibernate/hibernate-entitymanager/3.6.4.Final/hibernate-entitymanager-3.6.4.Final.pom
[INFO] Unable to find resource 'org.hibernate:hibernate-entitymanager:pom:3.6.4.Final' in repository dhis.uio.no (http://dhis.uio.no/maven/external)
Downloading: http://repo1.maven.org/maven2/org/hibernate/hibernate-entitymanager/3.6.4.Final/hibernate-entitymanager-3.6.4.Final.pom

Downloading: http://www.amplecode.org/maven2/javassist/javassist/3.12.0.GA/javassist-3.12.0.GA.pom
[INFO] Unable to find resource 'javassist:javassist:pom:3.12.0.GA' in repository amplecode_maven2_repo (http://www.amplecode.org/maven2)
Downloading: http://dhis.uio.no/maven/external/javassist/javassist/3.12.0.GA/javassist-3.12.0.GA.pom
[INFO] Unable to find resource 'javassist:javassist:pom:3.12.0.GA' in repository dhis.uio.no (http://dhis.uio.no/maven/external)
Downloading: http://repo1.maven.org/maven2/javassist/javassist/3.12.0.GA/javassist-3.12.0.GA.pom

Downloading: http://www.amplecode.org/maven2/javassist/javassist/3.12.0.GA/javassist-3.12.0.GA.jar
Downloading: http://www.amplecode.org/maven2/net/sf/ehcache/ehcache-core/2.4.1/ehcache-core-2.4.1.jar
Downloading: http://www.amplecode.org/maven2/org/hibernate/hibernate-ehcache/3.6.4.Final/hibernate-ehcache-3.6.4.Final.jar
[INFO] Unable to find resource 'javassist:javassist:jar:3.12.0.GA' in repository amplecode_maven2_repo (http://www.amplecode.org/maven2)
Downloading: http://dhis.uio.no/maven/external/javassist/javassist/3.12.0.GA/javassist-3.12.0.GA.jar
[INFO] Unable to find resource 'net.sf.ehcache:ehcache-core:jar:2.4.1' in repository amplecode_maven2_repo (http://www.amplecode.org/maven2)
Downloading: http://dhis.uio.no/maven/external/net/sf/ehcache/ehcache-core/2.4.1/ehcache-core-2.4.1.jar
[INFO] Unable to find resource 'javassist:javassist:jar:3.12.0.GA' in repository dhis.uio.no (http://dhis.uio.no/maven/external)
Downloading: http://repo1.maven.org/maven2/javassist/javassist/3.12.0.GA/javassist-3.12.0.GA.jar
[INFO] Unable to find resource 'net.sf.ehcache:ehcache-core:jar:2.4.1' in repository dhis.uio.no (http://dhis.uio.no/maven/external)
[INFO] Unable to find resource 'org.hibernate:hibernate-ehcache:jar:3.6.4.Final' in repository amplecode_maven2_repo (http://www.amplecode.org/maven2)
Downloading: http://repo1.maven.org/maven2/net/sf/ehcache/ehcache-core/2.4.1/ehcache-core-2.4.1.jar
Downloading: http://dhis.uio.no/maven/external/org/hibernate/hibernate-ehcache/3.6.4.Final/hibernate-ehcache-3.6.4.Final.jar
[INFO] Unable to find resource 'org.hibernate:hibernate-ehcache:jar:3.6.4.Final' in repository dhis.uio.no (http://dhis.uio.no/maven/external)
Downloading: http://repo1.maven.org/maven2/org/hibernate/hibernate-ehcache/3.6.4.Final/hibernate-ehcache-3.6.4.Final.jar

Downloading: http://www.amplecode.org/maven2/org/hibernate/hibernate-entitymanager/3.6.4.Final/hibernate-entitymanager-3.6.4.Final.jar
[INFO] Unable to find resource 'org.hibernate:hibernate-entitymanager:jar:3.6.4.Final' in repository amplecode_maven2_repo (http://www.amplecode.org/maven2)
Downloading: http://dhis.uio.no/maven/external/org/hibernate/hibernate-entitymanager/3.6.4.Final/hibernate-entitymanager-3.6.4.Final.jar
[INFO] Unable to find resource 'org.hibernate:hibernate-entitymanager:jar:3.6.4.Final' in repository dhis.uio.no (http://dhis.uio.no/maven/external)
Downloading: http://repo1.maven.org/maven2/org/hibernate/hibernate-entitymanager/3.6.4.Final/hibernate-entitymanager-3.6.4.Final.jar

[INFO] [compiler:compile {execution: default-compile}]
[INFO] Compiling 12 source files to <http://dhis.uio.no/ci/job/Dhis2%20Service%20Trunk/ws/dhis-2/dhis-support/dhis-support-hibernate/target/classes>
[INFO] [resources:testResources {execution: default-testResources}]
[INFO] Using encoding: 'UTF-8' to copy filtered resources.
[INFO] [compiler:testCompile {execution: default-testCompile}]
[INFO] Nothing to compile - all classes are up to date
[WARNING] DEPRECATED [systemProperties]: Use systemPropertyVariables instead.
[INFO] [surefire:test {execution: default-test}]
[INFO] Surefire report directory: <http://dhis.uio.no/ci/job/Dhis2%20Service%20Trunk/ws/dhis-2/dhis-support/dhis-support-hibernate/target/surefire-reports>

-------------------------------------------------------
T E S T S
-------------------------------------------------------
There are no tests to run.

Results :

Tests run: 0, Failures: 0, Errors: 0, Skipped: 0

[JENKINS] Recording test results
[INFO] [jar:jar {execution: default-jar}]
[INFO] Building jar: <http://dhis.uio.no/ci/job/Dhis2%20Service%20Trunk/ws/dhis-2/dhis-support/dhis-support-hibernate/target/dhis-support-hibernate-2.3-SNAPSHOT.jar>
[INFO] [install:install {execution: default-install}]
[INFO] Installing <http://dhis.uio.no/ci/job/Dhis2%20Service%20Trunk/ws/dhis-2/dhis-support/dhis-support-hibernate/target/dhis-support-hibernate-2.3-SNAPSHOT.jar> to /ifi/utgard/p01/dhis/.m2/repository/org/hisp/dhis/dhis-support-hibernate/2.3-SNAPSHOT/dhis-support-hibernate-2.3-SNAPSHOT.jar
[INFO] Preparing findbugs:findbugs
[JENKINS] Archiving <http://dhis.uio.no/ci/job/Dhis2%20Service%20Trunk/ws/dhis-2/dhis-support/dhis-support-hibernate/pom.xml> to /projects/hisp/jenkins_home/jobs/Dhis2 Service Trunk/modules/org.hisp.dhis$dhis-support-hibernate/builds/2011-05-28_16-01-48/archive/org.hisp.dhis/dhis-support-hibernate/2.3-SNAPSHOT/dhis-support-hibernate-2.3-SNAPSHOT.pom
[JENKINS] Archiving <http://dhis.uio.no/ci/job/Dhis2%20Service%20Trunk/ws/dhis-2/dhis-support/dhis-support-hibernate/target/dhis-support-hibernate-2.3-SNAPSHOT.jar> to /projects/hisp/jenkins_home/jobs/Dhis2 Service Trunk/modules/org.hisp.dhis$dhis-support-hibernate/builds/2011-05-28_16-01-48/archive/org.hisp.dhis/dhis-support-hibernate/2.3-SNAPSHOT/dhis-support-hibernate-2.3-SNAPSHOT.jar
[INFO] [resources:resources {execution: default-resources}]
[INFO] Using encoding: 'UTF-8' to copy filtered resources.
[INFO] [compiler:compile {execution: default-compile}]
[INFO] Nothing to compile - all classes are up to date
[INFO] [findbugs:findbugs {execution: default-cli}]
[INFO] Using source root:
[INFO] <http://dhis.uio.no/ci/job/Dhis2%20Service%20Trunk/ws/dhis-2/dhis-support/dhis-support-hibernate/target/classes>
[INFO] Using test source root:
[INFO] <http://dhis.uio.no/ci/job/Dhis2%20Service%20Trunk/ws/dhis-2/dhis-support/dhis-support-hibernate/target/test-classes>
[INFO] No effort provided, using default effort.
[INFO] Adding Source Directory: <http://dhis.uio.no/ci/job/Dhis2%20Service%20Trunk/ws/dhis-2/dhis-support/dhis-support-hibernate/src/main/java>
[INFO] No threshold provided, using default threshold.
[INFO] Using FindBugs Version: 1.3.8
[INFO] No threshold provided, using default threshold.
[INFO] No threshold provided, using default threshold.
[INFO] No threshold provided, using default threshold.
[INFO] Using the xdoc format
[INFO] No effort provided, using default effort.
[INFO] No threshold provided, using default threshold.
[INFO] No threshold provided, using default threshold.
[INFO] Debugging is Off
[INFO] No bug include filter.
[INFO] Using bug exclude filter /tmp/plexus-resources650193546tmp
[INFO] Printing Errors
[INFO] Printing Missing classes
[INFO] Printing Source Roots
[FINDBUGS] Successfully parsed file <http://dhis.uio.no/ci/job/Dhis2%20Service%20Trunk/ws/dhis-2/dhis-support/dhis-support-hibernate/target/findbugsXml.xml> of module DHIS Hibernate Support with 0 warnings.
[INFO] ------------------------------------------------------------------------
[INFO] Building DHIS System Support
[INFO] task-segment: [clean, install, findbugs:findbugs]
[INFO] ------------------------------------------------------------------------
[INFO] [clean:clean {execution: default-clean}]
[INFO] Deleting directory <http://dhis.uio.no/ci/job/Dhis2%20Service%20Trunk/ws/dhis-2/dhis-support/dhis-support-system/target>
[INFO] [resources:resources {execution: default-resources}]
[INFO] Using encoding: 'UTF-8' to copy filtered resources.
Downloading: http://www.amplecode.org/maven2/org/slf4j/slf4j-log4j12/1.6.1/slf4j-log4j12-1.6.1.pom
[INFO] Unable to find resource 'org.slf4j:slf4j-log4j12:pom:1.6.1' in repository amplecode_maven2_repo (http://www.amplecode.org/maven2)
Downloading: http://dhis.uio.no/maven/external/org/slf4j/slf4j-log4j12/1.6.1/slf4j-log4j12-1.6.1.pom
[INFO] Unable to find resource 'org.slf4j:slf4j-log4j12:pom:1.6.1' in repository dhis.uio.no (http://dhis.uio.no/maven/external)
Downloading: http://repo1.maven.org/maven2/org/slf4j/slf4j-log4j12/1.6.1/slf4j-log4j12-1.6.1.pom

Downloading: http://www.amplecode.org/maven2/log4j/log4j/1.2.16/log4j-1.2.16.pom
[INFO] Unable to find resource 'log4j:log4j:pom:1.2.16' in repository amplecode_maven2_repo (http://www.amplecode.org/maven2)
Downloading: http://dhis.uio.no/maven/external/log4j/log4j/1.2.16/log4j-1.2.16.pom
[INFO] Unable to find resource 'log4j:log4j:pom:1.2.16' in repository dhis.uio.no (http://dhis.uio.no/maven/external)
Downloading: http://repo1.maven.org/maven2/log4j/log4j/1.2.16/log4j-1.2.16.pom

Downloading: http://www.amplecode.org/maven2/log4j/log4j/1.2.16/log4j-1.2.16.jar
Downloading: http://www.amplecode.org/maven2/org/slf4j/slf4j-log4j12/1.6.1/slf4j-log4j12-1.6.1.jar
[INFO] Unable to find resource 'log4j:log4j:jar:1.2.16' in repository amplecode_maven2_repo (http://www.amplecode.org/maven2)
Downloading: http://dhis.uio.no/maven/external/log4j/log4j/1.2.16/log4j-1.2.16.jar
[INFO] Unable to find resource 'org.slf4j:slf4j-log4j12:jar:1.6.1' in repository amplecode_maven2_repo (http://www.amplecode.org/maven2)
Downloading: http://dhis.uio.no/maven/external/org/slf4j/slf4j-log4j12/1.6.1/slf4j-log4j12-1.6.1.jar
[INFO] Unable to find resource 'log4j:log4j:jar:1.2.16' in repository dhis.uio.no (http://dhis.uio.no/maven/external)
Downloading: http://repo1.maven.org/maven2/log4j/log4j/1.2.16/log4j-1.2.16.jar
[INFO] Unable to find resource 'org.slf4j:slf4j-log4j12:jar:1.6.1' in repository dhis.uio.no (http://dhis.uio.no/maven/external)
Downloading: http://repo1.maven.org/maven2/org/slf4j/slf4j-log4j12/1.6.1/slf4j-log4j12-1.6.1.jar

[INFO] [compiler:compile {execution: default-compile}]
[INFO] Compiling 74 source files to <http://dhis.uio.no/ci/job/Dhis2%20Service%20Trunk/ws/dhis-2/dhis-support/dhis-support-system/target/classes>
[JENKINS] Archiving <http://dhis.uio.no/ci/job/Dhis2%20Service%20Trunk/ws/dhis-2/dhis-support/dhis-support-system/pom.xml> to /projects/hisp/jenkins_home/jobs/Dhis2 Service Trunk/modules/org.hisp.dhis$dhis-support-system/builds/2011-05-28_16-01-48/archive/org.hisp.dhis/dhis-support-system/2.3-SNAPSHOT/dhis-support-system-2.3-SNAPSHOT.pom
[INFO] ------------------------------------------------------------------------
[ERROR] BUILD ERROR
[INFO] ------------------------------------------------------------------------
[INFO] Internal error in the plugin manager executing goal 'org.apache.maven.plugins:maven-compiler-plugin:2.3.2:compile': <http://dhis.uio.no/ci/job/Dhis2%20Service%20Trunk/ws/dhis-2/dhis-support/dhis-support-external/target/dhis-support-external-2.3-SNAPSHOT.jar> (No such file or directory)
[INFO] ------------------------------------------------------------------------
[INFO] For more information, run Maven with the -e switch
[INFO] ------------------------------------------------------------------------
[INFO] Total time: 2 minutes 51 seconds
[INFO] Finished at: Sat May 28 16:04:46 CEST 2011
[INFO] Final Memory: 93M/799M
[INFO] ------------------------------------------------------------------------
channel stopped

See <http://dhis.uio.no/ci/job/Dhis2%20Service%20Trunk/2755/changes>

Changes:

[Lars Helge Overland] Fixed bug, wrong use of js method

···

------------------------------------------
[...truncated 547 lines...]
[INFO] No bug include filter.
[INFO] Using bug exclude filter /tmp/plexus-resources1439954300tmp
[INFO] Printing Errors
[INFO] Printing Missing classes
[INFO] Printing Source Roots
[FINDBUGS] Successfully parsed file <http://dhis.uio.no/ci/job/Dhis2%20Service%20Trunk/ws/dhis-2/dhis-support/dhis-support-jdbc/target/findbugsXml.xml> of module DHIS JDBC Service with 0 warnings.
[INFO] ------------------------------------------------------------------------
[INFO] Building DHIS XML framework services
[INFO] task-segment: [clean, install, findbugs:findbugs]
[INFO] ------------------------------------------------------------------------
[INFO] [clean:clean {execution: default-clean}]
[INFO] Deleting directory <http://dhis.uio.no/ci/job/Dhis2%20Service%20Trunk/ws/dhis-2/dhis-support/dhis-support-xml/target>
[INFO] [resources:resources {execution: default-resources}]
[INFO] Using encoding: 'UTF-8' to copy filtered resources.
[INFO] [compiler:compile {execution: default-compile}]
[INFO] Compiling 14 source files to <http://dhis.uio.no/ci/job/Dhis2%20Service%20Trunk/ws/dhis-2/dhis-support/dhis-support-xml/target/classes>
[INFO] [resources:testResources {execution: default-testResources}]
[INFO] Using encoding: 'UTF-8' to copy filtered resources.
[INFO] [compiler:testCompile {execution: default-testCompile}]
[INFO] Compiling 5 source files to <http://dhis.uio.no/ci/job/Dhis2%20Service%20Trunk/ws/dhis-2/dhis-support/dhis-support-xml/target/test-classes>
[WARNING] DEPRECATED [systemProperties]: Use systemPropertyVariables instead.
[INFO] [surefire:test {execution: default-test}]
[INFO] Surefire report directory: <http://dhis.uio.no/ci/job/Dhis2%20Service%20Trunk/ws/dhis-2/dhis-support/dhis-support-xml/target/surefire-reports>

-------------------------------------------------------
T E S T S
-------------------------------------------------------
Running org.amplecode.staxwax.framework.XMLPipeTest
Number of events : 80
Tests run: 3, Failures: 0, Errors: 0, Skipped: 0, Time elapsed: 2.372 sec
Running org.amplecode.staxwax.framework.XPathFilterTest
Tests run: 4, Failures: 0, Errors: 0, Skipped: 0, Time elapsed: 0.268 sec
Running org.amplecode.staxwax.transformer.TransformerTaskTest
Tests run: 1, Failures: 0, Errors: 0, Skipped: 0, Time elapsed: 0.377 sec
Running org.amplecode.staxwax.reader.XMLReaderTest
Tests run: 12, Failures: 0, Errors: 0, Skipped: 0, Time elapsed: 0.528 sec
Running org.amplecode.staxwax.writer.XMLWriterTest
Tests run: 3, Failures: 0, Errors: 0, Skipped: 0, Time elapsed: 0.195 sec

Results :

Tests run: 23, Failures: 0, Errors: 0, Skipped: 0

[JENKINS] Recording test results
[INFO] [jar:jar {execution: default-jar}]
[INFO] Building jar: <http://dhis.uio.no/ci/job/Dhis2%20Service%20Trunk/ws/dhis-2/dhis-support/dhis-support-xml/target/dhis-support-xml-2.3-SNAPSHOT.jar>
[INFO] [install:install {execution: default-install}]
[INFO] Installing <http://dhis.uio.no/ci/job/Dhis2%20Service%20Trunk/ws/dhis-2/dhis-support/dhis-support-xml/target/dhis-support-xml-2.3-SNAPSHOT.jar> to /ifi/utgard/p01/dhis/.m2/repository/org/hisp/dhis/dhis-support-xml/2.3-SNAPSHOT/dhis-support-xml-2.3-SNAPSHOT.jar
[INFO] Preparing findbugs:findbugs
[JENKINS] Archiving <http://dhis.uio.no/ci/job/Dhis2%20Service%20Trunk/ws/dhis-2/dhis-support/dhis-support-xml/pom.xml> to /projects/hisp/jenkins_home/jobs/Dhis2 Service Trunk/modules/org.hisp.dhis$dhis-support-xml/builds/2011-05-28_17-01-33/archive/org.hisp.dhis/dhis-support-xml/2.3-SNAPSHOT/dhis-support-xml-2.3-SNAPSHOT.pom
[JENKINS] Archiving <http://dhis.uio.no/ci/job/Dhis2%20Service%20Trunk/ws/dhis-2/dhis-support/dhis-support-xml/target/dhis-support-xml-2.3-SNAPSHOT.jar> to /projects/hisp/jenkins_home/jobs/Dhis2 Service Trunk/modules/org.hisp.dhis$dhis-support-xml/builds/2011-05-28_17-01-33/archive/org.hisp.dhis/dhis-support-xml/2.3-SNAPSHOT/dhis-support-xml-2.3-SNAPSHOT.jar
[INFO] [resources:resources {execution: default-resources}]
[INFO] Using encoding: 'UTF-8' to copy filtered resources.
[INFO] [compiler:compile {execution: default-compile}]
[INFO] Nothing to compile - all classes are up to date
[INFO] [findbugs:findbugs {execution: default-cli}]
[INFO] Using source root:
[INFO] <http://dhis.uio.no/ci/job/Dhis2%20Service%20Trunk/ws/dhis-2/dhis-support/dhis-support-xml/target/classes>
[INFO] Using test source root:
[INFO] <http://dhis.uio.no/ci/job/Dhis2%20Service%20Trunk/ws/dhis-2/dhis-support/dhis-support-xml/target/test-classes>
[INFO] No effort provided, using default effort.
[INFO] Adding Source Directory: <http://dhis.uio.no/ci/job/Dhis2%20Service%20Trunk/ws/dhis-2/dhis-support/dhis-support-xml/src/main/java>
[INFO] No threshold provided, using default threshold.
[INFO] Using FindBugs Version: 1.3.8
[INFO] No threshold provided, using default threshold.
[INFO] No threshold provided, using default threshold.
[INFO] No threshold provided, using default threshold.
[INFO] Using the xdoc format
[INFO] No effort provided, using default effort.
[INFO] No threshold provided, using default threshold.
[INFO] No threshold provided, using default threshold.
[INFO] Debugging is Off
[INFO] No bug include filter.
[INFO] Using bug exclude filter /tmp/plexus-resources8634922tmp
[INFO] Printing Errors
[INFO] Printing Missing classes
[INFO] Printing Source Roots
[FINDBUGS] Successfully parsed file <http://dhis.uio.no/ci/job/Dhis2%20Service%20Trunk/ws/dhis-2/dhis-support/dhis-support-xml/target/findbugsXml.xml> of module DHIS XML framework services with 1 warnings.
[INFO] ------------------------------------------------------------------------
[INFO] Building DHIS Services Parent Project
[INFO] task-segment: [clean, install, findbugs:findbugs]
[INFO] ------------------------------------------------------------------------
[INFO] [clean:clean {execution: default-clean}]
[INFO] [site:attach-descriptor {execution: default-attach-descriptor}]
[INFO] [install:install {execution: default-install}]
[INFO] Installing <http://dhis.uio.no/ci/job/Dhis2%20Service%20Trunk/ws/dhis-2/dhis-services/pom.xml> to /ifi/utgard/p01/dhis/.m2/repository/org/hisp/dhis/dhis-services/2.3-SNAPSHOT/dhis-services-2.3-SNAPSHOT.pom
[INFO] Preparing findbugs:findbugs
[INFO] No goals needed for project - skipping
[INFO] [findbugs:findbugs {execution: default-cli}]
[INFO] Using source root:
[INFO] <http://dhis.uio.no/ci/job/Dhis2%20Service%20Trunk/ws/dhis-2/dhis-services/target/classes>
[INFO] Using test source root:
[INFO] <http://dhis.uio.no/ci/job/Dhis2%20Service%20Trunk/ws/dhis-2/dhis-services/target/test-classes>
[INFO] Output class directory doesn't exist. Skipping findbugs.
[JENKINS] Archiving <http://dhis.uio.no/ci/job/Dhis2%20Service%20Trunk/ws/dhis-2/dhis-services/pom.xml> to /projects/hisp/jenkins_home/jobs/Dhis2 Service Trunk/modules/org.hisp.dhis$dhis-services/builds/2011-05-28_17-01-33/archive/org.hisp.dhis/dhis-services/2.3-SNAPSHOT/dhis-services-2.3-SNAPSHOT.pom
[INFO] ------------------------------------------------------------------------
[INFO] Building DHIS Core API Implementations
[INFO] task-segment: [clean, install, findbugs:findbugs]
[INFO] ------------------------------------------------------------------------
[INFO] [clean:clean {execution: default-clean}]
[INFO] Deleting directory <http://dhis.uio.no/ci/job/Dhis2%20Service%20Trunk/ws/dhis-2/dhis-services/dhis-service-core/target>
[INFO] [resources:resources {execution: default-resources}]
[INFO] Using encoding: 'UTF-8' to copy filtered resources.
[INFO] [compiler:compile {execution: default-compile}]
[INFO] Compiling 102 source files to <http://dhis.uio.no/ci/job/Dhis2%20Service%20Trunk/ws/dhis-2/dhis-services/dhis-service-core/target/classes>
[INFO] [resources:testResources {execution: default-testResources}]
[INFO] Using encoding: 'UTF-8' to copy filtered resources.
[INFO] [compiler:testCompile {execution: default-testCompile}]
[INFO] Compiling 56 source files to <http://dhis.uio.no/ci/job/Dhis2%20Service%20Trunk/ws/dhis-2/dhis-services/dhis-service-core/target/test-classes>
[WARNING] DEPRECATED [systemProperties]: Use systemPropertyVariables instead.
[INFO] [surefire:test {execution: default-test}]
[INFO] Surefire report directory: <http://dhis.uio.no/ci/job/Dhis2%20Service%20Trunk/ws/dhis-2/dhis-services/dhis-service-core/target/surefire-reports>

-------------------------------------------------------
T E S T S
-------------------------------------------------------
Running org.hisp.dhis.sequence.SequenceGeneratorTest
Tests run: 1, Failures: 0, Errors: 0, Skipped: 0, Time elapsed: 11.827 sec
Running org.hisp.dhis.dataelement.DataElementCategoryStoreTest
Tests run: 3, Failures: 0, Errors: 0, Skipped: 0, Time elapsed: 0.165 sec
Running org.hisp.dhis.dataelement.DataElementCategoryComboServiceTest
Tests run: 3, Failures: 0, Errors: 0, Skipped: 0, Time elapsed: 0.155 sec
Running org.hisp.dhis.dataelement.DataElementCategoryOptionServiceTest
Tests run: 3, Failures: 0, Errors: 0, Skipped: 0, Time elapsed: 0.141 sec
Running org.hisp.dhis.dataelement.DataElementCategoryServiceTest
Tests run: 3, Failures: 0, Errors: 0, Skipped: 0, Time elapsed: 0.149 sec
Running org.hisp.dhis.dataelement.DataElementCategoryOptionComboStoreTest
Tests run: 4, Failures: 0, Errors: 0, Skipped: 0, Time elapsed: 0.18 sec
Running org.hisp.dhis.dataelement.DataElementServiceTest
Tests run: 19, Failures: 0, Errors: 0, Skipped: 0, Time elapsed: 1.475 sec
Running org.hisp.dhis.dataelement.DataElementCategoryComboStoreTest
Tests run: 3, Failures: 0, Errors: 0, Skipped: 0, Time elapsed: 0.094 sec
Running org.hisp.dhis.dataelement.DataElementGroupStoreTest
Tests run: 6, Failures: 0, Errors: 0, Skipped: 0, Time elapsed: 0.209 sec
Running org.hisp.dhis.dataelement.DataElementGroupSetStoreTest
Tests run: 4, Failures: 0, Errors: 0, Skipped: 0, Time elapsed: 0.142 sec
Running org.hisp.dhis.dataelement.DataElementStoreTest
Tests run: 16, Failures: 0, Errors: 0, Skipped: 0, Time elapsed: 0.712 sec
Running org.hisp.dhis.dataelement.DataElementCategoryOptionComboServiceTest
Tests run: 4, Failures: 0, Errors: 0, Skipped: 0, Time elapsed: 0.179 sec
Running org.hisp.dhis.dataelement.DataElementCategoryOptionStoreTest
Tests run: 3, Failures: 0, Errors: 0, Skipped: 0, Time elapsed: 0.117 sec
Running org.hisp.dhis.i18n.I18nServiceTranslationTest
Tests run: 5, Failures: 0, Errors: 0, Skipped: 0, Time elapsed: 0.217 sec
Running org.hisp.dhis.i18n.I18nServiceTest
Tests run: 5, Failures: 0, Errors: 0, Skipped: 0, Time elapsed: 0.23 sec
Running org.hisp.dhis.dataset.CompleteDataSetRegistrationServiceTest
Tests run: 7, Failures: 0, Errors: 0, Skipped: 0, Time elapsed: 0.598 sec
Running org.hisp.dhis.dataset.DataSetStoreTest
Tests run: 7, Failures: 0, Errors: 0, Skipped: 0, Time elapsed: 0.237 sec
Running org.hisp.dhis.dataset.SectionStoreTest
Tests run: 2, Failures: 0, Errors: 0, Skipped: 0, Time elapsed: 0.096 sec
Running org.hisp.dhis.dataset.CompleteDataSetRegistrationStoreTest
Tests run: 7, Failures: 0, Errors: 0, Skipped: 0, Time elapsed: 0.386 sec
Running org.hisp.dhis.dataset.DataSetServiceTest
Tests run: 8, Failures: 0, Errors: 0, Skipped: 0, Time elapsed: 0.379 sec
Running org.hisp.dhis.expression.ExpressionStoreTest
Tests run: 4, Failures: 0, Errors: 0, Skipped: 0, Time elapsed: 0.335 sec
Running org.hisp.dhis.expression.ExpressionServiceTest
Tests run: 14, Failures: 0, Errors: 0, Skipped: 0, Time elapsed: 2.053 sec
Running org.hisp.dhis.datavalue.DataValueDimensionTest
Tests run: 2, Failures: 0, Errors: 0, Skipped: 0, Time elapsed: 0.135 sec
Running org.hisp.dhis.datavalue.DataValueStoreTest
Tests run: 12, Failures: 0, Errors: 0, Skipped: 0, Time elapsed: 0.839 sec
Running org.hisp.dhis.datavalue.DataValueServiceTest
Tests run: 12, Failures: 0, Errors: 0, Skipped: 0, Time elapsed: 0.827 sec
Running org.hisp.dhis.concept.ConceptServiceTest
Tests run: 6, Failures: 0, Errors: 0, Skipped: 0, Time elapsed: 0.285 sec
Running org.hisp.dhis.indicator.IndicatorStoreTest
Tests run: 13, Failures: 0, Errors: 0, Skipped: 0, Time elapsed: 0.459 sec
Running org.hisp.dhis.indicator.IndicatorGroupSetStoreTest
Tests run: 4, Failures: 0, Errors: 0, Skipped: 0, Time elapsed: 0.097 sec
Running org.hisp.dhis.indicator.IndicatorGroupStoreTest
Tests run: 6, Failures: 0, Errors: 0, Skipped: 0, Time elapsed: 0.145 sec
Running org.hisp.dhis.indicator.IndicatorServiceTest
Tests run: 20, Failures: 0, Errors: 0, Skipped: 0, Time elapsed: 0.718 sec
Running org.hisp.dhis.validation.ValidationCriteriaServiceTest
Tests run: 5, Failures: 0, Errors: 0, Skipped: 0, Time elapsed: 0.133 sec
Running org.hisp.dhis.validation.ValidationRuleStoreTest
Tests run: 7, Failures: 0, Errors: 0, Skipped: 0, Time elapsed: 0.49 sec
Running org.hisp.dhis.validation.ValidationCriteriaStoreTest
Tests run: 5, Failures: 0, Errors: 0, Skipped: 0, Time elapsed: 0.19 sec
Running org.hisp.dhis.validation.ValidationRuleGroupStoreTest
Tests run: 5, Failures: 0, Errors: 0, Skipped: 0, Time elapsed: 0.302 sec
Running org.hisp.dhis.validation.ValidationRuleServiceTest
Tests run: 16, Failures: 0, Errors: 0, Skipped: 0, Time elapsed: 1.66 sec
Running org.hisp.dhis.organisationunit.OrganisationUnitServiceTest
Tests run: 21, Failures: 0, Errors: 0, Skipped: 0, Time elapsed: 0.62 sec
Running org.hisp.dhis.organisationunit.OrganisationUnitGroupSetStoreTest
Tests run: 4, Failures: 0, Errors: 0, Skipped: 0, Time elapsed: 0.107 sec
Running org.hisp.dhis.organisationunit.OrganisationUnitGroupStoreTest
Tests run: 4, Failures: 0, Errors: 0, Skipped: 0, Time elapsed: 0.104 sec
Running org.hisp.dhis.organisationunit.OrganisationUnitStoreTest
Tests run: 3, Failures: 0, Errors: 0, Skipped: 0, Time elapsed: 0.072 sec
Running org.hisp.dhis.translation.TranslationServiceTest
Tests run: 7, Failures: 0, Errors: 0, Skipped: 0, Time elapsed: 0.22 sec
Running org.hisp.dhis.translation.TranslationStoreTest
Tests run: 7, Failures: 0, Errors: 0, Skipped: 1, Time elapsed: 0.176 sec
Running org.hisp.dhis.user.UserStoreTest
Tests run: 4, Failures: 0, Errors: 0, Skipped: 0, Time elapsed: 0.191 sec
Running org.hisp.dhis.user.UserGroupServiceTest
Tests run: 6, Failures: 0, Errors: 0, Skipped: 0, Time elapsed: 0.229 sec
Running org.hisp.dhis.minmax.MinMaxDataElementStoreTest
Tests run: 1, Failures: 0, Errors: 0, Skipped: 0, Time elapsed: 0.075 sec
Running org.hisp.dhis.datadictionary.DataDictionaryStoreTest
Tests run: 4, Failures: 0, Errors: 0, Skipped: 0, Time elapsed: 0.179 sec
Running org.hisp.dhis.datadictionary.DataDictionaryServiceTest
Tests run: 4, Failures: 0, Errors: 0, Skipped: 0, Time elapsed: 0.187 sec
Running org.hisp.dhis.period.PeriodServiceTest
Tests run: 13, Failures: 0, Errors: 0, Skipped: 0, Time elapsed: 0.641 sec
Running org.hisp.dhis.period.PeriodStoreTest
Tests run: 12, Failures: 0, Errors: 0, Skipped: 0, Time elapsed: 0.66 sec
Running org.hisp.dhis.dataanalysis.MinMaxOutlierAnalysisServiceTest
Tests run: 1, Failures: 0, Errors: 0, Skipped: 0, Time elapsed: 0.141 sec
Running org.hisp.dhis.dataanalysis.StdDevOutlierAnalysisServiceTest
Tests run: 1, Failures: 0, Errors: 0, Skipped: 0, Time elapsed: 0.134 sec
Running org.hisp.dhis.dataentryform.DataEntryFormServiceTest
Tests run: 9, Failures: 0, Errors: 0, Skipped: 0, Time elapsed: 0.389 sec
Running org.hisp.dhis.dataentryform.DataEntryFormStoreTest
Tests run: 5, Failures: 0, Errors: 0, Skipped: 0, Time elapsed: 0.174 sec
Running org.hisp.dhis.message.MessageServiceTest
Tests run: 6, Failures: 0, Errors: 0, Skipped: 0, Time elapsed: 0.242 sec

Results :

Tests run: 356, Failures: 0, Errors: 0, Skipped: 1

[JENKINS] Recording test results
[INFO] [jar:jar {execution: default-jar}]
[INFO] Building jar: <http://dhis.uio.no/ci/job/Dhis2%20Service%20Trunk/ws/dhis-2/dhis-services/dhis-service-core/target/dhis-service-core-2.3-SNAPSHOT.jar>
[INFO] [install:install {execution: default-install}]
[INFO] Installing <http://dhis.uio.no/ci/job/Dhis2%20Service%20Trunk/ws/dhis-2/dhis-services/dhis-service-core/target/dhis-service-core-2.3-SNAPSHOT.jar> to /ifi/utgard/p01/dhis/.m2/repository/org/hisp/dhis/dhis-service-core/2.3-SNAPSHOT/dhis-service-core-2.3-SNAPSHOT.jar
[INFO] Preparing findbugs:findbugs
[JENKINS] Archiving <http://dhis.uio.no/ci/job/Dhis2%20Service%20Trunk/ws/dhis-2/dhis-services/dhis-service-core/pom.xml> to /projects/hisp/jenkins_home/jobs/Dhis2 Service Trunk/modules/org.hisp.dhis$dhis-service-core/builds/2011-05-28_17-01-33/archive/org.hisp.dhis/dhis-service-core/2.3-SNAPSHOT/dhis-service-core-2.3-SNAPSHOT.pom
[JENKINS] Archiving <http://dhis.uio.no/ci/job/Dhis2%20Service%20Trunk/ws/dhis-2/dhis-services/dhis-service-core/target/dhis-service-core-2.3-SNAPSHOT.jar> to /projects/hisp/jenkins_home/jobs/Dhis2 Service Trunk/modules/org.hisp.dhis$dhis-service-core/builds/2011-05-28_17-01-33/archive/org.hisp.dhis/dhis-service-core/2.3-SNAPSHOT/dhis-service-core-2.3-SNAPSHOT.jar
[INFO] [resources:resources {execution: default-resources}]
[INFO] Using encoding: 'UTF-8' to copy filtered resources.
[INFO] ------------------------------------------------------------------------
[ERROR] BUILD ERROR
[INFO] ------------------------------------------------------------------------
[INFO] Internal error in the plugin manager executing goal 'org.apache.maven.plugins:maven-resources-plugin:2.2:resources': <http://dhis.uio.no/ci/job/Dhis2%20Service%20Trunk/ws/dhis-2/dhis-support/dhis-support-external/target/dhis-support-external-2.3-SNAPSHOT.jar> (No such file or directory)
[INFO] ------------------------------------------------------------------------
[INFO] For more information, run Maven with the -e switch
[INFO] ------------------------------------------------------------------------
[INFO] Total time: 2 minutes 54 seconds
[INFO] Finished at: Sat May 28 17:04:35 CEST 2011
[INFO] Final Memory: 129M/743M
[INFO] ------------------------------------------------------------------------
channel stopped

See <http://dhis.uio.no/ci/job/Dhis2%20Service%20Trunk/2756/changes>

Changes:

[Lars Helge Overland] Fixed bug related to deletion of Sections. Updating OrganisationUnit child/parent bi-directional association on both sides. This to avoid caching issues but should be done anyway.

···

------------------------------------------
[...truncated 658 lines...]
[INFO] Building jar: <http://dhis.uio.no/ci/job/Dhis2%20Service%20Trunk/ws/dhis-2/dhis-support/dhis-support-xml/target/dhis-support-xml-2.3-SNAPSHOT.jar>
[INFO] [install:install {execution: default-install}]
[INFO] Installing <http://dhis.uio.no/ci/job/Dhis2%20Service%20Trunk/ws/dhis-2/dhis-support/dhis-support-xml/target/dhis-support-xml-2.3-SNAPSHOT.jar> to /ifi/utgard/p01/dhis/.m2/repository/org/hisp/dhis/dhis-support-xml/2.3-SNAPSHOT/dhis-support-xml-2.3-SNAPSHOT.jar
[INFO] Preparing findbugs:findbugs
[JENKINS] Archiving <http://dhis.uio.no/ci/job/Dhis2%20Service%20Trunk/ws/dhis-2/dhis-support/dhis-support-xml/pom.xml> to /projects/hisp/jenkins_home/jobs/Dhis2 Service Trunk/modules/org.hisp.dhis$dhis-support-xml/builds/2011-05-28_21-01-37/archive/org.hisp.dhis/dhis-support-xml/2.3-SNAPSHOT/dhis-support-xml-2.3-SNAPSHOT.pom
[JENKINS] Archiving <http://dhis.uio.no/ci/job/Dhis2%20Service%20Trunk/ws/dhis-2/dhis-support/dhis-support-xml/target/dhis-support-xml-2.3-SNAPSHOT.jar> to /projects/hisp/jenkins_home/jobs/Dhis2 Service Trunk/modules/org.hisp.dhis$dhis-support-xml/builds/2011-05-28_21-01-37/archive/org.hisp.dhis/dhis-support-xml/2.3-SNAPSHOT/dhis-support-xml-2.3-SNAPSHOT.jar
[INFO] [resources:resources {execution: default-resources}]
[INFO] Using encoding: 'UTF-8' to copy filtered resources.
[INFO] [compiler:compile {execution: default-compile}]
[INFO] Nothing to compile - all classes are up to date
[INFO] [findbugs:findbugs {execution: default-cli}]
[INFO] Using source root:
[INFO] <http://dhis.uio.no/ci/job/Dhis2%20Service%20Trunk/ws/dhis-2/dhis-support/dhis-support-xml/target/classes>
[INFO] Using test source root:
[INFO] <http://dhis.uio.no/ci/job/Dhis2%20Service%20Trunk/ws/dhis-2/dhis-support/dhis-support-xml/target/test-classes>
[INFO] No effort provided, using default effort.
[INFO] Adding Source Directory: <http://dhis.uio.no/ci/job/Dhis2%20Service%20Trunk/ws/dhis-2/dhis-support/dhis-support-xml/src/main/java>
[INFO] No threshold provided, using default threshold.
[INFO] Using FindBugs Version: 1.3.8
[INFO] No threshold provided, using default threshold.
[INFO] No threshold provided, using default threshold.
[INFO] No threshold provided, using default threshold.
[INFO] Using the xdoc format
[INFO] No effort provided, using default effort.
[INFO] No threshold provided, using default threshold.
[INFO] No threshold provided, using default threshold.
[INFO] Debugging is Off
[INFO] No bug include filter.
[INFO] Using bug exclude filter /tmp/plexus-resources773240770tmp
[INFO] Printing Errors
[INFO] Printing Missing classes
[INFO] Printing Source Roots
[FINDBUGS] Successfully parsed file <http://dhis.uio.no/ci/job/Dhis2%20Service%20Trunk/ws/dhis-2/dhis-support/dhis-support-xml/target/findbugsXml.xml> of module DHIS XML framework services with 1 warnings.
[INFO] ------------------------------------------------------------------------
[INFO] Building DHIS Services Parent Project
[INFO] task-segment: [clean, install, findbugs:findbugs]
[INFO] ------------------------------------------------------------------------
[INFO] [clean:clean {execution: default-clean}]
[INFO] [site:attach-descriptor {execution: default-attach-descriptor}]
[INFO] [install:install {execution: default-install}]
[INFO] Installing <http://dhis.uio.no/ci/job/Dhis2%20Service%20Trunk/ws/dhis-2/dhis-services/pom.xml> to /ifi/utgard/p01/dhis/.m2/repository/org/hisp/dhis/dhis-services/2.3-SNAPSHOT/dhis-services-2.3-SNAPSHOT.pom
[INFO] Preparing findbugs:findbugs
[INFO] No goals needed for project - skipping
[INFO] [findbugs:findbugs {execution: default-cli}]
[INFO] Using source root:
[INFO] <http://dhis.uio.no/ci/job/Dhis2%20Service%20Trunk/ws/dhis-2/dhis-services/target/classes>
[INFO] Using test source root:
[INFO] <http://dhis.uio.no/ci/job/Dhis2%20Service%20Trunk/ws/dhis-2/dhis-services/target/test-classes>
[INFO] Output class directory doesn't exist. Skipping findbugs.
[JENKINS] Archiving <http://dhis.uio.no/ci/job/Dhis2%20Service%20Trunk/ws/dhis-2/dhis-services/pom.xml> to /projects/hisp/jenkins_home/jobs/Dhis2 Service Trunk/modules/org.hisp.dhis$dhis-services/builds/2011-05-28_21-01-36/archive/org.hisp.dhis/dhis-services/2.3-SNAPSHOT/dhis-services-2.3-SNAPSHOT.pom
[INFO] ------------------------------------------------------------------------
[INFO] Building DHIS Core API Implementations
[INFO] task-segment: [clean, install, findbugs:findbugs]
[INFO] ------------------------------------------------------------------------
[INFO] [clean:clean {execution: default-clean}]
[INFO] Deleting directory <http://dhis.uio.no/ci/job/Dhis2%20Service%20Trunk/ws/dhis-2/dhis-services/dhis-service-core/target>
[INFO] [resources:resources {execution: default-resources}]
[INFO] Using encoding: 'UTF-8' to copy filtered resources.
[INFO] [compiler:compile {execution: default-compile}]
[INFO] Compiling 102 source files to <http://dhis.uio.no/ci/job/Dhis2%20Service%20Trunk/ws/dhis-2/dhis-services/dhis-service-core/target/classes>
[INFO] [resources:testResources {execution: default-testResources}]
[INFO] Using encoding: 'UTF-8' to copy filtered resources.
[INFO] [compiler:testCompile {execution: default-testCompile}]
[INFO] Compiling 56 source files to <http://dhis.uio.no/ci/job/Dhis2%20Service%20Trunk/ws/dhis-2/dhis-services/dhis-service-core/target/test-classes>
[WARNING] DEPRECATED [systemProperties]: Use systemPropertyVariables instead.
[INFO] [surefire:test {execution: default-test}]
[INFO] Surefire report directory: <http://dhis.uio.no/ci/job/Dhis2%20Service%20Trunk/ws/dhis-2/dhis-services/dhis-service-core/target/surefire-reports>

-------------------------------------------------------
T E S T S
-------------------------------------------------------
Running org.hisp.dhis.sequence.SequenceGeneratorTest
Tests run: 1, Failures: 0, Errors: 0, Skipped: 0, Time elapsed: 13.156 sec
Running org.hisp.dhis.dataelement.DataElementCategoryStoreTest
Tests run: 3, Failures: 0, Errors: 0, Skipped: 0, Time elapsed: 0.19 sec
Running org.hisp.dhis.dataelement.DataElementCategoryComboServiceTest
Tests run: 3, Failures: 0, Errors: 0, Skipped: 0, Time elapsed: 0.178 sec
Running org.hisp.dhis.dataelement.DataElementCategoryOptionServiceTest
Tests run: 3, Failures: 0, Errors: 0, Skipped: 0, Time elapsed: 0.182 sec
Running org.hisp.dhis.dataelement.DataElementCategoryServiceTest
Tests run: 3, Failures: 0, Errors: 0, Skipped: 0, Time elapsed: 0.201 sec
Running org.hisp.dhis.dataelement.DataElementCategoryOptionComboStoreTest
Tests run: 4, Failures: 0, Errors: 0, Skipped: 0, Time elapsed: 0.204 sec
Running org.hisp.dhis.dataelement.DataElementServiceTest
Tests run: 19, Failures: 0, Errors: 0, Skipped: 0, Time elapsed: 1.466 sec
Running org.hisp.dhis.dataelement.DataElementCategoryComboStoreTest
Tests run: 3, Failures: 0, Errors: 0, Skipped: 0, Time elapsed: 0.1 sec
Running org.hisp.dhis.dataelement.DataElementGroupStoreTest
Tests run: 6, Failures: 0, Errors: 0, Skipped: 0, Time elapsed: 0.207 sec
Running org.hisp.dhis.dataelement.DataElementGroupSetStoreTest
Tests run: 4, Failures: 0, Errors: 0, Skipped: 0, Time elapsed: 0.129 sec
Running org.hisp.dhis.dataelement.DataElementStoreTest
Tests run: 16, Failures: 0, Errors: 0, Skipped: 0, Time elapsed: 0.584 sec
Running org.hisp.dhis.dataelement.DataElementCategoryOptionComboServiceTest
Tests run: 4, Failures: 0, Errors: 0, Skipped: 0, Time elapsed: 0.151 sec
Running org.hisp.dhis.dataelement.DataElementCategoryOptionStoreTest
Tests run: 3, Failures: 0, Errors: 0, Skipped: 0, Time elapsed: 0.092 sec
Running org.hisp.dhis.i18n.I18nServiceTranslationTest
Tests run: 5, Failures: 0, Errors: 0, Skipped: 0, Time elapsed: 0.192 sec
Running org.hisp.dhis.i18n.I18nServiceTest
Tests run: 5, Failures: 0, Errors: 0, Skipped: 0, Time elapsed: 0.215 sec
Running org.hisp.dhis.dataset.CompleteDataSetRegistrationServiceTest
Tests run: 7, Failures: 0, Errors: 0, Skipped: 0, Time elapsed: 0.833 sec
Running org.hisp.dhis.dataset.DataSetStoreTest
Tests run: 7, Failures: 0, Errors: 0, Skipped: 0, Time elapsed: 0.372 sec
Running org.hisp.dhis.dataset.SectionStoreTest
Tests run: 2, Failures: 0, Errors: 0, Skipped: 0, Time elapsed: 0.133 sec
Running org.hisp.dhis.dataset.CompleteDataSetRegistrationStoreTest
Tests run: 7, Failures: 0, Errors: 0, Skipped: 0, Time elapsed: 0.563 sec
Running org.hisp.dhis.dataset.DataSetServiceTest
Tests run: 8, Failures: 0, Errors: 0, Skipped: 0, Time elapsed: 0.482 sec
Running org.hisp.dhis.expression.ExpressionStoreTest
Tests run: 4, Failures: 0, Errors: 0, Skipped: 0, Time elapsed: 0.383 sec
Running org.hisp.dhis.expression.ExpressionServiceTest
Tests run: 14, Failures: 0, Errors: 0, Skipped: 0, Time elapsed: 1.933 sec
Running org.hisp.dhis.datavalue.DataValueDimensionTest
Tests run: 2, Failures: 0, Errors: 0, Skipped: 0, Time elapsed: 0.157 sec
Running org.hisp.dhis.datavalue.DataValueStoreTest
Tests run: 12, Failures: 0, Errors: 0, Skipped: 0, Time elapsed: 0.728 sec
Running org.hisp.dhis.datavalue.DataValueServiceTest
Tests run: 12, Failures: 0, Errors: 0, Skipped: 0, Time elapsed: 0.487 sec
Running org.hisp.dhis.concept.ConceptServiceTest
Tests run: 6, Failures: 0, Errors: 0, Skipped: 0, Time elapsed: 0.198 sec
Running org.hisp.dhis.indicator.IndicatorStoreTest
Tests run: 13, Failures: 0, Errors: 0, Skipped: 0, Time elapsed: 0.33 sec
Running org.hisp.dhis.indicator.IndicatorGroupSetStoreTest
Tests run: 4, Failures: 0, Errors: 0, Skipped: 0, Time elapsed: 0.098 sec
Running org.hisp.dhis.indicator.IndicatorGroupStoreTest
Tests run: 6, Failures: 0, Errors: 0, Skipped: 0, Time elapsed: 0.149 sec
Running org.hisp.dhis.indicator.IndicatorServiceTest
Tests run: 20, Failures: 0, Errors: 0, Skipped: 0, Time elapsed: 0.955 sec
Running org.hisp.dhis.validation.ValidationCriteriaServiceTest
Tests run: 5, Failures: 0, Errors: 0, Skipped: 0, Time elapsed: 0.133 sec
Running org.hisp.dhis.validation.ValidationRuleStoreTest
Tests run: 7, Failures: 0, Errors: 0, Skipped: 0, Time elapsed: 0.428 sec
Running org.hisp.dhis.validation.ValidationCriteriaStoreTest
Tests run: 5, Failures: 0, Errors: 0, Skipped: 0, Time elapsed: 0.163 sec
Running org.hisp.dhis.validation.ValidationRuleGroupStoreTest
Tests run: 5, Failures: 0, Errors: 0, Skipped: 0, Time elapsed: 0.259 sec
Running org.hisp.dhis.validation.ValidationRuleServiceTest
Tests run: 16, Failures: 0, Errors: 0, Skipped: 0, Time elapsed: 1.563 sec
Running org.hisp.dhis.organisationunit.OrganisationUnitServiceTest
Tests run: 21, Failures: 0, Errors: 0, Skipped: 0, Time elapsed: 0.776 sec
Running org.hisp.dhis.organisationunit.OrganisationUnitGroupSetStoreTest
Tests run: 4, Failures: 0, Errors: 0, Skipped: 0, Time elapsed: 0.158 sec
Running org.hisp.dhis.organisationunit.OrganisationUnitGroupStoreTest
Tests run: 4, Failures: 0, Errors: 0, Skipped: 0, Time elapsed: 0.152 sec
Running org.hisp.dhis.organisationunit.OrganisationUnitStoreTest
Tests run: 3, Failures: 0, Errors: 0, Skipped: 0, Time elapsed: 0.118 sec
Running org.hisp.dhis.translation.TranslationServiceTest
Tests run: 7, Failures: 0, Errors: 0, Skipped: 0, Time elapsed: 0.304 sec
Running org.hisp.dhis.translation.TranslationStoreTest
Tests run: 7, Failures: 0, Errors: 0, Skipped: 1, Time elapsed: 0.247 sec
Running org.hisp.dhis.user.UserStoreTest
Tests run: 4, Failures: 0, Errors: 0, Skipped: 0, Time elapsed: 0.202 sec
Running org.hisp.dhis.user.UserGroupServiceTest
Tests run: 6, Failures: 0, Errors: 0, Skipped: 0, Time elapsed: 0.235 sec
Running org.hisp.dhis.minmax.MinMaxDataElementStoreTest
Tests run: 1, Failures: 0, Errors: 0, Skipped: 0, Time elapsed: 0.075 sec
Running org.hisp.dhis.datadictionary.DataDictionaryStoreTest
Tests run: 4, Failures: 0, Errors: 0, Skipped: 0, Time elapsed: 0.179 sec
Running org.hisp.dhis.datadictionary.DataDictionaryServiceTest
Tests run: 4, Failures: 0, Errors: 0, Skipped: 0, Time elapsed: 0.192 sec
Running org.hisp.dhis.period.PeriodServiceTest
Tests run: 13, Failures: 0, Errors: 0, Skipped: 0, Time elapsed: 0.67 sec
Running org.hisp.dhis.period.PeriodStoreTest
Tests run: 12, Failures: 0, Errors: 0, Skipped: 0, Time elapsed: 0.619 sec
Running org.hisp.dhis.dataanalysis.MinMaxOutlierAnalysisServiceTest
Tests run: 1, Failures: 0, Errors: 0, Skipped: 0, Time elapsed: 0.14 sec
Running org.hisp.dhis.dataanalysis.StdDevOutlierAnalysisServiceTest
Tests run: 1, Failures: 0, Errors: 0, Skipped: 0, Time elapsed: 0.135 sec
Running org.hisp.dhis.dataentryform.DataEntryFormServiceTest
Tests run: 9, Failures: 0, Errors: 0, Skipped: 0, Time elapsed: 0.434 sec
Running org.hisp.dhis.dataentryform.DataEntryFormStoreTest
Tests run: 5, Failures: 0, Errors: 0, Skipped: 0, Time elapsed: 0.173 sec
Running org.hisp.dhis.message.MessageServiceTest
Tests run: 6, Failures: 0, Errors: 0, Skipped: 0, Time elapsed: 0.239 sec

Results :

Tests run: 356, Failures: 0, Errors: 0, Skipped: 1

[JENKINS] Recording test results
[INFO] [jar:jar {execution: default-jar}]
[INFO] Building jar: <http://dhis.uio.no/ci/job/Dhis2%20Service%20Trunk/ws/dhis-2/dhis-services/dhis-service-core/target/dhis-service-core-2.3-SNAPSHOT.jar>
[INFO] [install:install {execution: default-install}]
[INFO] Installing <http://dhis.uio.no/ci/job/Dhis2%20Service%20Trunk/ws/dhis-2/dhis-services/dhis-service-core/target/dhis-service-core-2.3-SNAPSHOT.jar> to /ifi/utgard/p01/dhis/.m2/repository/org/hisp/dhis/dhis-service-core/2.3-SNAPSHOT/dhis-service-core-2.3-SNAPSHOT.jar
[INFO] Preparing findbugs:findbugs
[JENKINS] Archiving <http://dhis.uio.no/ci/job/Dhis2%20Service%20Trunk/ws/dhis-2/dhis-services/dhis-service-core/pom.xml> to /projects/hisp/jenkins_home/jobs/Dhis2 Service Trunk/modules/org.hisp.dhis$dhis-service-core/builds/2011-05-28_21-01-36/archive/org.hisp.dhis/dhis-service-core/2.3-SNAPSHOT/dhis-service-core-2.3-SNAPSHOT.pom
[JENKINS] Archiving <http://dhis.uio.no/ci/job/Dhis2%20Service%20Trunk/ws/dhis-2/dhis-services/dhis-service-core/target/dhis-service-core-2.3-SNAPSHOT.jar> to /projects/hisp/jenkins_home/jobs/Dhis2 Service Trunk/modules/org.hisp.dhis$dhis-service-core/builds/2011-05-28_21-01-36/archive/org.hisp.dhis/dhis-service-core/2.3-SNAPSHOT/dhis-service-core-2.3-SNAPSHOT.jar
[INFO] [resources:resources {execution: default-resources}]
[INFO] Using encoding: 'UTF-8' to copy filtered resources.
[INFO] [compiler:compile {execution: default-compile}]
[INFO] Nothing to compile - all classes are up to date
[INFO] [findbugs:findbugs {execution: default-cli}]
[INFO] Using source root:
[INFO] <http://dhis.uio.no/ci/job/Dhis2%20Service%20Trunk/ws/dhis-2/dhis-services/dhis-service-core/target/classes>
[INFO] Using test source root:
[INFO] <http://dhis.uio.no/ci/job/Dhis2%20Service%20Trunk/ws/dhis-2/dhis-services/dhis-service-core/target/test-classes>
[INFO] No effort provided, using default effort.
[INFO] Adding Source Directory: <http://dhis.uio.no/ci/job/Dhis2%20Service%20Trunk/ws/dhis-2/dhis-services/dhis-service-core/src/main/java>
[INFO] No threshold provided, using default threshold.
[INFO] Using FindBugs Version: 1.3.8
[INFO] No threshold provided, using default threshold.
[INFO] No threshold provided, using default threshold.
[INFO] No threshold provided, using default threshold.
[INFO] Using the xdoc format
[INFO] No effort provided, using default effort.
[INFO] No threshold provided, using default threshold.
[INFO] No threshold provided, using default threshold.
[INFO] Debugging is Off
[INFO] No bug include filter.
[INFO] Using bug exclude filter /tmp/plexus-resources638391394tmp
[INFO] Printing Errors
[INFO] Printing Missing classes
[INFO] Printing Source Roots
[FINDBUGS] Successfully parsed file <http://dhis.uio.no/ci/job/Dhis2%20Service%20Trunk/ws/dhis-2/dhis-services/dhis-service-core/target/findbugsXml.xml> of module DHIS Core API Implementations with 73 warnings.
[INFO] ------------------------------------------------------------------------
[INFO] Building DHIS I18n Static
[INFO] task-segment: [clean, install, findbugs:findbugs]
[INFO] ------------------------------------------------------------------------
[INFO] [clean:clean {execution: default-clean}]
[INFO] Deleting directory <http://dhis.uio.no/ci/job/Dhis2%20Service%20Trunk/ws/dhis-2/dhis-services/dhis-service-i18n/target>
[INFO] [resources:resources {execution: default-resources}]
[INFO] Using encoding: 'UTF-8' to copy filtered resources.
[INFO] [compiler:compile {execution: default-compile}]
[INFO] Compiling 9 source files to <http://dhis.uio.no/ci/job/Dhis2%20Service%20Trunk/ws/dhis-2/dhis-services/dhis-service-i18n/target/classes>
[INFO] -------------------------------------------------------------
[ERROR] COMPILATION ERROR :
[INFO] -------------------------------------------------------------
[ERROR] error: error reading <http://dhis.uio.no/ci/job/Dhis2%20Service%20Trunk/ws/dhis-2/dhis-support/dhis-support-external/target/dhis-support-external-2.3-SNAPSHOT.jar;> error in opening zip file
[INFO] 1 error
[INFO] -------------------------------------------------------------
[JENKINS] Archiving <http://dhis.uio.no/ci/job/Dhis2%20Service%20Trunk/ws/dhis-2/dhis-services/dhis-service-i18n/pom.xml> to /projects/hisp/jenkins_home/jobs/Dhis2 Service Trunk/modules/org.hisp.dhis$dhis-service-i18n/builds/2011-05-28_21-01-36/archive/org.hisp.dhis/dhis-service-i18n/2.3-SNAPSHOT/dhis-service-i18n-2.3-SNAPSHOT.pom
[INFO] ------------------------------------------------------------------------
[ERROR] BUILD FAILURE
[INFO] ------------------------------------------------------------------------
[INFO] Compilation failure
error: error reading <http://dhis.uio.no/ci/job/Dhis2%20Service%20Trunk/ws/dhis-2/dhis-support/dhis-support-external/target/dhis-support-external-2.3-SNAPSHOT.jar;> error in opening zip file

[INFO] ------------------------------------------------------------------------
[INFO] For more information, run Maven with the -e switch
[INFO] ------------------------------------------------------------------------
[INFO] Total time: 3 minutes
[INFO] Finished at: Sat May 28 21:04:43 CEST 2011
[INFO] Final Memory: 125M/729M
[INFO] ------------------------------------------------------------------------
Sending e-mails to: dhis2-devs@lists.launchpad.net
channel stopped

See <http://dhis.uio.no/ci/job/Dhis2%20Service%20Trunk/2757/changes>

Changes:

[Lars Helge Overland] Pushed method to service layer

[Lars Helge Overland] Changed namespace for hibernate dtd files

[Morten Olav Hansen] Removed all traces of old paging. New plugin uses one-time ajax-load + client-side filtering instead (old plugin still available). Group filtering not implemented.

···

------------------------------------------
Started by an SCM change
$ bzr revision-info -d "<http://dhis.uio.no/ci/job/Dhis2%20Service%20Trunk/ws/">
info result: bzr revision-info -d <http://dhis.uio.no/ci/job/Dhis2%20Service%20Trunk/ws/> returned 0. Command output: "3775 larshelge@gmail.com-20110528180539-meju2vitoek736ld
" stderr: ""
ERROR: Ignore Problem expanding maven opts macros org.jenkinsci.plugins.tokenmacro.TokenMacro
[workspace] $ bzr pull --overwrite https://code.launchpad.net/~dhis2-devs-core/dhis2/trunk
+N dhis-2/dhis-web/dhis-web-commons-resources/src/main/webapp/dhis-web-commons/javascripts/jQuery/jquery.dhisAjaxSelect.js
M dhis-2/dhis-api/src/main/java/org/hisp/dhis/user/UserService.java
M dhis-2/dhis-services/dhis-service-administration/src/main/resources/org/hisp/dhis/datalock/hibernate/DataSetLock.hbm.xml
M dhis-2/dhis-services/dhis-service-administration/src/main/resources/org/hisp/dhis/sqlview/hibernate/SqlView.hbm.xml
M dhis-2/dhis-services/dhis-service-administration/src/main/resources/org/hisp/dhis/useraudit/hibernate/LoginFailure.hbm.xml
M dhis-2/dhis-services/dhis-service-core/src/main/java/org/hisp/dhis/dataset/DefaultDataSetService.java
M dhis-2/dhis-services/dhis-service-core/src/main/java/org/hisp/dhis/user/DefaultUserService.java
M dhis-2/dhis-services/dhis-service-core/src/main/resources/org/hisp/dhis/concept/hibernate/Concept.hbm.xml
M dhis-2/dhis-services/dhis-service-core/src/main/resources/org/hisp/dhis/datadictionary/hibernate/DataDictionary.hbm.xml
M dhis-2/dhis-services/dhis-service-core/src/main/resources/org/hisp/dhis/dataelement/hibernate/DataElement.hbm.xml
M dhis-2/dhis-services/dhis-service-core/src/main/resources/org/hisp/dhis/dataelement/hibernate/DataElementCategory.hbm.xml
M dhis-2/dhis-services/dhis-service-core/src/main/resources/org/hisp/dhis/dataelement/hibernate/DataElementCategoryCombo.hbm.xml
M dhis-2/dhis-services/dhis-service-core/src/main/resources/org/hisp/dhis/dataelement/hibernate/DataElementCategoryOption.hbm.xml
M dhis-2/dhis-services/dhis-service-core/src/main/resources/org/hisp/dhis/dataelement/hibernate/DataElementCategoryOptionCombo.hbm.xml
M dhis-2/dhis-services/dhis-service-core/src/main/resources/org/hisp/dhis/dataelement/hibernate/DataElementGroup.hbm.xml
M dhis-2/dhis-services/dhis-service-core/src/main/resources/org/hisp/dhis/dataelement/hibernate/DataElementGroupSet.hbm.xml
M dhis-2/dhis-services/dhis-service-core/src/main/resources/org/hisp/dhis/dataelement/hibernate/DataElementOperand.hbm.xml
M dhis-2/dhis-services/dhis-service-core/src/main/resources/org/hisp/dhis/dataentryform/hibernate/DataEntryForm.hbm.xml
M dhis-2/dhis-services/dhis-service-core/src/main/resources/org/hisp/dhis/dataset/hibernate/DataSet.hbm.xml
M dhis-2/dhis-services/dhis-service-core/src/main/resources/org/hisp/dhis/dataset/hibernate/Section.hbm.xml
M dhis-2/dhis-services/dhis-service-core/src/main/resources/org/hisp/dhis/datavalue/hibernate/DataValue.hbm.xml
M dhis-2/dhis-services/dhis-service-core/src/main/resources/org/hisp/dhis/datavalue/hibernate/DataValueAudit.hbm.xml
M dhis-2/dhis-services/dhis-service-core/src/main/resources/org/hisp/dhis/expression/hibernate/Expression.hbm.xml
M dhis-2/dhis-services/dhis-service-core/src/main/resources/org/hisp/dhis/indicator/hibernate/Indicator.hbm.xml
M dhis-2/dhis-services/dhis-service-core/src/main/resources/org/hisp/dhis/indicator/hibernate/IndicatorGroup.hbm.xml
M dhis-2/dhis-services/dhis-service-core/src/main/resources/org/hisp/dhis/indicator/hibernate/IndicatorGroupSet.hbm.xml
M dhis-2/dhis-services/dhis-service-core/src/main/resources/org/hisp/dhis/indicator/hibernate/IndicatorType.hbm.xml
M dhis-2/dhis-services/dhis-service-core/src/main/resources/org/hisp/dhis/message/hibernate/Message.hbm.xml
M dhis-2/dhis-services/dhis-service-core/src/main/resources/org/hisp/dhis/message/hibernate/UserMessage.hbm.xml
M dhis-2/dhis-services/dhis-service-core/src/main/resources/org/hisp/dhis/minmax/hibernate/MinMaxDataElement.hbm.xml
M dhis-2/dhis-services/dhis-service-core/src/main/resources/org/hisp/dhis/organisationunit/hibernate/OrganisationUnit.hbm.xml
M dhis-2/dhis-services/dhis-service-core/src/main/resources/org/hisp/dhis/organisationunit/hibernate/OrganisationUnitGroup.hbm.xml
M dhis-2/dhis-services/dhis-service-core/src/main/resources/org/hisp/dhis/organisationunit/hibernate/OrganisationUnitGroupSet.hbm.xml
M dhis-2/dhis-services/dhis-service-core/src/main/resources/org/hisp/dhis/organisationunit/hibernate/OrganisationUnitLevel.hbm.xml
M dhis-2/dhis-services/dhis-service-core/src/main/resources/org/hisp/dhis/period/hibernate/Period.hbm.xml
M dhis-2/dhis-services/dhis-service-core/src/main/resources/org/hisp/dhis/sequence/hibernate/Sequence.hbm.xml
M dhis-2/dhis-services/dhis-service-core/src/main/resources/org/hisp/dhis/translation/hibernate/Translation.hbm.xml
M dhis-2/dhis-services/dhis-service-core/src/main/resources/org/hisp/dhis/user/hibernate/User.hbm.xml
M dhis-2/dhis-services/dhis-service-core/src/main/resources/org/hisp/dhis/user/hibernate/UserAuthorityGroup.hbm.xml
M dhis-2/dhis-services/dhis-service-core/src/main/resources/org/hisp/dhis/user/hibernate/UserCredentials.hbm.xml
M dhis-2/dhis-services/dhis-service-core/src/main/resources/org/hisp/dhis/user/hibernate/UserGroup.hbm.xml
M dhis-2/dhis-services/dhis-service-core/src/main/resources/org/hisp/dhis/validation/hibernate/ValidationCriteria.hbm.xml
M dhis-2/dhis-services/dhis-service-core/src/main/resources/org/hisp/dhis/validation/hibernate/ValidationRule.hbm.xml
M dhis-2/dhis-services/dhis-service-core/src/main/resources/org/hisp/dhis/validation/hibernate/ValidationRuleGroup.hbm.xml
M dhis-2/dhis-services/dhis-service-datamart-default/src/main/resources/org/hisp/dhis/datamart/hibernate/DataMartExport.hbm.xml
M dhis-2/dhis-services/dhis-service-importexport/src/main/resources/org/hisp/dhis/importexport/hibernate/ImportDataValue.hbm.xml
M dhis-2/dhis-services/dhis-service-mapping/src/main/resources/org/hisp/dhis/mapping/hibernate/MapLayer.hbm.xml
M dhis-2/dhis-services/dhis-service-options/src/main/resources/org/hisp/dhis/option/setting/hibernate/SystemSetting.hbm.xml
M dhis-2/dhis-services/dhis-service-patient/src/main/resources/org/hisp/dhis/caseaggregation/hibernate/CaseAggregationCondition.hbm.xml
M dhis-2/dhis-services/dhis-service-patient/src/main/resources/org/hisp/dhis/patient/hibernate/Patient.hbm.xml
M dhis-2/dhis-services/dhis-service-patient/src/main/resources/org/hisp/dhis/patient/hibernate/PatientAttribute.hbm.xml
M dhis-2/dhis-services/dhis-service-patient/src/main/resources/org/hisp/dhis/patient/hibernate/PatientAttributeGroup.hbm.xml
M dhis-2/dhis-services/dhis-service-patient/src/main/resources/org/hisp/dhis/patient/hibernate/PatientAttributeOption.hbm.xml
M dhis-2/dhis-services/dhis-service-patient/src/main/resources/org/hisp/dhis/patient/hibernate/PatientIdentifier.hbm.xml
M dhis-2/dhis-services/dhis-service-patient/src/main/resources/org/hisp/dhis/patient/hibernate/PatientIdentifierType.hbm.xml
M dhis-2/dhis-services/dhis-service-patient/src/main/resources/org/hisp/dhis/patient/hibernate/PatientMobileSetting.hbm.xml
M dhis-2/dhis-services/dhis-service-patient/src/main/resources/org/hisp/dhis/patientattributevalue/hibernate/PatientAttributeValue.hbm.xml
M dhis-2/dhis-services/dhis-service-patient/src/main/resources/org/hisp/dhis/patientdatavalue/hibernate/PatientDataValue.hbm.xml
M dhis-2/dhis-services/dhis-service-patient/src/main/resources/org/hisp/dhis/program/hibernate/Program.hbm.xml
M dhis-2/dhis-services/dhis-service-patient/src/main/resources/org/hisp/dhis/program/hibernate/ProgramAttributeOption.hbm.xml
M dhis-2/dhis-services/dhis-service-patient/src/main/resources/org/hisp/dhis/program/hibernate/ProgramInstance.hbm.xml
M dhis-2/dhis-services/dhis-service-patient/src/main/resources/org/hisp/dhis/program/hibernate/ProgramStage.hbm.xml
M dhis-2/dhis-services/dhis-service-patient/src/main/resources/org/hisp/dhis/program/hibernate/ProgramStageDataElement.hbm.xml
M dhis-2/dhis-services/dhis-service-patient/src/main/resources/org/hisp/dhis/program/hibernate/ProgramValidation.hbm.xml
M dhis-2/dhis-services/dhis-service-patient/src/main/resources/org/hisp/dhis/programattributevalue/hibernate/ProgramAttributeValue.hbm.xml
M dhis-2/dhis-services/dhis-service-patient/src/main/resources/org/hisp/dhis/relationship/hibernate/Relationship.hbm.xml
M dhis-2/dhis-services/dhis-service-patient/src/main/resources/org/hisp/dhis/relationship/hibernate/RelationshipType.hbm.xml
M dhis-2/dhis-services/dhis-service-reporting/src/main/resources/org/hisp/dhis/chart/hibernate/Chart.hbm.xml
M dhis-2/dhis-services/dhis-service-reporting/src/main/resources/org/hisp/dhis/dashboard/hibernate/DashboardContent.hbm.xml
M dhis-2/dhis-services/dhis-service-reporting/src/main/resources/org/hisp/dhis/document/hibernate/Document.hbm.xml
M dhis-2/dhis-services/dhis-service-reporting/src/main/resources/org/hisp/dhis/report/hibernate/Report.hbm.xml
M dhis-2/dhis-services/dhis-service-reporting/src/main/resources/org/hisp/dhis/reporttable/hibernate/ReportTable.hbm.xml
M dhis-2/dhis-web/dhis-web-commons-resources/src/main/webapp/dhis-web-commons/javascripts/jQuery/jquery.dhisPaging.js
M dhis-2/dhis-web/dhis-web-commons-resources/src/main/webapp/main.vm
M dhis-2/dhis-web/dhis-web-commons/src/main/java/org/hisp/dhis/commons/action/GetDataElementGroupAction.java
M dhis-2/dhis-web/dhis-web-commons/src/main/java/org/hisp/dhis/commons/action/GetDataElementGroupSetAction.java
M dhis-2/dhis-web/dhis-web-commons/src/main/java/org/hisp/dhis/commons/action/GetDataElementGroupsAction.java
M dhis-2/dhis-web/dhis-web-commons/src/main/java/org/hisp/dhis/commons/action/GetDataElementsAction.java
M dhis-2/dhis-web/dhis-web-commons/src/main/java/org/hisp/dhis/commons/action/GetDataSetsAction.java
M dhis-2/dhis-web/dhis-web-commons/src/main/java/org/hisp/dhis/commons/action/GetIndicatorGroupAction.java
M dhis-2/dhis-web/dhis-web-commons/src/main/java/org/hisp/dhis/commons/action/GetIndicatorGroupSetAction.java
M dhis-2/dhis-web/dhis-web-commons/src/main/java/org/hisp/dhis/commons/action/GetIndicatorGroupsAction.java
M dhis-2/dhis-web/dhis-web-commons/src/main/java/org/hisp/dhis/commons/action/GetIndicatorsAction.java
M dhis-2/dhis-web/dhis-web-commons/src/main/java/org/hisp/dhis/commons/action/GetOrganisationUnitChildrenAction.java
M dhis-2/dhis-web/dhis-web-commons/src/main/java/org/hisp/dhis/commons/action/GetOrganisationUnitGroupsAction.java
M dhis-2/dhis-web/dhis-web-commons/src/main/java/org/hisp/dhis/commons/action/GetOrganisationUnitsAction.java
M dhis-2/dhis-web/dhis-web-commons/src/main/java/org/hisp/dhis/commons/action/GetPeriodsAction.java
M dhis-2/dhis-web/dhis-web-commons/src/main/java/org/hisp/dhis/commons/action/GetUsersAction.java
M dhis-2/dhis-web/dhis-web-commons/src/main/java/org/hisp/dhis/commons/action/LoadDocumentAction.java
M dhis-2/dhis-web/dhis-web-commons/src/main/java/org/hisp/dhis/commons/action/NoAction.java
M dhis-2/dhis-web/dhis-web-maintenance/dhis-web-maintenance-datadictionary/src/main/webapp/dhis-web-maintenance-datadictionary/addDataElementGroupForm.vm
M dhis-2/dhis-web/dhis-web-maintenance/dhis-web-maintenance-datadictionary/src/main/webapp/dhis-web-maintenance-datadictionary/addDataElementGroupSet.vm
M dhis-2/dhis-web/dhis-web-maintenance/dhis-web-maintenance-datadictionary/src/main/webapp/dhis-web-maintenance-datadictionary/addIndicatorGroupForm.vm
M dhis-2/dhis-web/dhis-web-maintenance/dhis-web-maintenance-datadictionary/src/main/webapp/dhis-web-maintenance-datadictionary/addIndicatorGroupSet.vm
M dhis-2/dhis-web/dhis-web-maintenance/dhis-web-maintenance-datadictionary/src/main/webapp/dhis-web-maintenance-datadictionary/updateDataElementGroupForm.vm
M dhis-2/dhis-web/dhis-web-maintenance/dhis-web-maintenance-datadictionary/src/main/webapp/dhis-web-maintenance-datadictionary/updateDataElementGroupSet.vm
M dhis-2/dhis-web/dhis-web-maintenance/dhis-web-maintenance-datadictionary/src/main/webapp/dhis-web-maintenance-datadictionary/updateIndicatorGroupForm.vm
M dhis-2/dhis-web/dhis-web-maintenance/dhis-web-maintenance-datadictionary/src/main/webapp/dhis-web-maintenance-datadictionary/updateIndicatorGroupSet.vm
M dhis-2/dhis-web/dhis-web-maintenance/dhis-web-maintenance-dataset/src/main/java/org/hisp/dhis/dataset/action/AddDataSetAction.java
M dhis-2/dhis-web/dhis-web-maintenance/dhis-web-maintenance-dataset/src/main/java/org/hisp/dhis/dataset/action/UpdateDataSetAction.java
M dhis-2/dhis-web/dhis-web-maintenance/dhis-web-maintenance-dataset/src/main/resources/META-INF/dhis/beans.xml
M dhis-2/dhis-web/dhis-web-maintenance/dhis-web-maintenance-dataset/src/main/webapp/dhis-web-maintenance-dataset/addDataSet.vm
M dhis-2/dhis-web/dhis-web-maintenance/dhis-web-maintenance-dataset/src/main/webapp/dhis-web-maintenance-dataset/editDataSet.vm
M dhis-2/dhis-web/dhis-web-maintenance/dhis-web-maintenance-dataset/src/main/webapp/dhis-web-maintenance-dataset/index.vm
M dhis-2/dhis-web/dhis-web-maintenance/dhis-web-maintenance-dataset/src/main/webapp/dhis-web-maintenance-dataset/javascript/viewDataEntryForm.js
M dhis-2/dhis-web/dhis-web-maintenance/dhis-web-maintenance-dataset/src/main/webapp/dhis-web-maintenance-dataset/viewDataEntryForm.vm
M dhis-2/dhis-web/dhis-web-maintenance/dhis-web-maintenance-organisationunit/src/main/webapp/dhis-web-maintenance-organisationunit/addOrganisationUnitGroupSetForm.vm
M dhis-2/dhis-web/dhis-web-maintenance/dhis-web-maintenance-organisationunit/src/main/webapp/dhis-web-maintenance-organisationunit/updateOrganisationUnitGroupSetForm.vm
M dhis-2/dhis-web/dhis-web-maintenance/dhis-web-maintenance-user/src/main/webapp/dhis-web-maintenance-user/addUserGroupForm.vm
M dhis-2/dhis-web/dhis-web-maintenance/dhis-web-maintenance-user/src/main/webapp/dhis-web-maintenance-user/updateUserGroupForm.vm
All changes applied successfully.
Now on revision 3778.
$ bzr revision-info -d "<http://dhis.uio.no/ci/job/Dhis2%20Service%20Trunk/ws/">
info result: bzr revision-info -d <http://dhis.uio.no/ci/job/Dhis2%20Service%20Trunk/ws/> returned 0. Command output: "3778 larshelge@gmail.com-20110528215318-86il5ta1ehuu4e2f
" stderr: ""
[workspace] $ bzr log -v -r revid:larshelge@gmail.com-20110528180539-meju2vitoek736ld..revid:larshelge@gmail.com-20110528215318-86il5ta1ehuu4e2f --long --show-ids
Getting local revision...
$ bzr revision-info -d "<http://dhis.uio.no/ci/job/Dhis2%20Service%20Trunk/ws/">
info result: bzr revision-info -d <http://dhis.uio.no/ci/job/Dhis2%20Service%20Trunk/ws/> returned 0. Command output: "3778 larshelge@gmail.com-20110528215318-86il5ta1ehuu4e2f
" stderr: ""
RevisionState revno:3778 revid:larshelge@gmail.com-20110528215318-86il5ta1ehuu4e2f
ERROR: Ignore Problem expanding maven opts macros org.jenkinsci.plugins.tokenmacro.TokenMacro
Found mavenVersion 2.2.1 from file jar:file:/projects/hisp/jenkins_home/tools/2.2.1/lib/maven-2.2.1-uber.jar!/META-INF/maven/org.apache.maven/maven-core/pom.properties
Parsing POMs
ERROR: Failed to parse POMs
java.io.IOException: Unable to delete /projects/hisp/jenkins_home/jobs/Dhis2 Service Trunk/modules/org.hisp.dhis$dhis-i18n/nextBuildNumber
  at hudson.util.AtomicFileWriter.commit(AtomicFileWriter.java:112)
  at hudson.util.TextFile.write(TextFile.java:81)
  at hudson.model.Job.saveNextBuildNumber(Job.java:224)
  at hudson.model.Job.updateNextBuildNumber(Job.java:299)
  at hudson.maven.MavenModuleSetBuild$RunnerImpl.parsePoms(MavenModuleSetBuild.java:871)
  at hudson.maven.MavenModuleSetBuild$RunnerImpl.doRun(MavenModuleSetBuild.java:617)
  at hudson.model.AbstractBuild$AbstractRunner.run(AbstractBuild.java:423)
  at hudson.model.Run.run(Run.java:1362)
  at hudson.maven.MavenModuleSetBuild.run(MavenModuleSetBuild.java:467)
  at hudson.model.ResourceController.execute(ResourceController.java:88)
  at hudson.model.Executor.run(Executor.java:145)

Things went a bit fast on friday, seems I had two instances running at the same time confusing each other..

Jo