Build failed in Jenkins: Dhis2 Service Trunk #2354

See <http://dhis.uio.no/ci/job/Dhis2%20Service%20Trunk/2354/changes>

Changes:

[Lars Helge Overland] Cleanup

···

------------------------------------------
[...truncated 2 lines...]
info result: bzr revision-info -d <http://dhis.uio.no/ci/job/Dhis2%20Service%20Trunk/ws/> returned 0. Command output: "3184 larshelge@gmail.com-20110328135232-sd47dv0x1rgibusp
" stderr: ""
[workspace] $ bzr pull --overwrite https://code.launchpad.net/~dhis2-devs-core/dhis2/trunk
M dhis-2/dhis-web/dhis-web-commons-resources/src/main/webapp/dhis-web-commons/css/widgets.css
All changes applied successfully.
Now on revision 3185.
$ bzr revision-info -d "<http://dhis.uio.no/ci/job/Dhis2%20Service%20Trunk/ws/">
info result: bzr revision-info -d <http://dhis.uio.no/ci/job/Dhis2%20Service%20Trunk/ws/> returned 0. Command output: "3185 larshelge@gmail.com-20110328141548-zo3d8e7jkk424xzt
" stderr: ""
[workspace] $ bzr log -v -r revid:larshelge@gmail.com-20110328135232-sd47dv0x1rgibusp..revid:larshelge@gmail.com-20110328141548-zo3d8e7jkk424xzt --long --show-ids
Getting local revision...
$ bzr revision-info -d "<http://dhis.uio.no/ci/job/Dhis2%20Service%20Trunk/ws/">
info result: bzr revision-info -d <http://dhis.uio.no/ci/job/Dhis2%20Service%20Trunk/ws/> returned 0. Command output: "3185 larshelge@gmail.com-20110328141548-zo3d8e7jkk424xzt
" stderr: ""
RevisionState revno:3185 revid:larshelge@gmail.com-20110328141548-zo3d8e7jkk424xzt
Found mavenVersion 2.2.1 from file jar:file:/ifi/utgard/p01/dhis/projects/dhis-dev.ifi.uio.no/ci/home/tools/2.2.1/lib/maven-2.2.1-uber.jar!/META-INF/maven/org.apache.maven/maven-core/pom.properties
Parsing POMs
[dhis-2] $ /local/opt/j2sdk/bin/java -Xmx2048m -XX:MaxPermSize=512m -cp /ifi/utgard/p01/dhis/projects/dhis-dev.ifi.uio.no/ci/home/plugins/maven-plugin/WEB-INF/lib/maven-agent-1.396.jar:/ifi/utgard/p01/dhis/projects/dhis-dev.ifi.uio.no/ci/home/tools/2.2.1/boot/classworlds-1.1.jar hudson.maven.agent.Main /ifi/utgard/p01/dhis/projects/dhis-dev.ifi.uio.no/ci/home/tools/2.2.1 /ifi/utgard/p01/dhis/projects/dhis-dev.ifi.uio.no/ci/tomcat/webapps/ci/WEB-INF/lib/remoting-1.396.jar /ifi/utgard/p01/dhis/projects/dhis-dev.ifi.uio.no/ci/home/plugins/maven-plugin/WEB-INF/lib/maven-interceptor-1.396.jar 56829 /ifi/utgard/p01/dhis/projects/dhis-dev.ifi.uio.no/ci/home/plugins/maven-plugin/WEB-INF/lib/maven2.1-interceptor-1.2.jar
<===[HUDSON REMOTING CAPACITY]===> channel started
Executing Maven: -B -f <http://dhis.uio.no/ci/job/Dhis2%20Service%20Trunk/ws/dhis-2/pom.xml> clean install findbugs:findbugs
[INFO] Scanning for projects...
[INFO] Reactor build order:
[INFO] DHIS 2
[INFO] DHIS API
[INFO] DHIS Support Parent Project
[INFO] DHIS Test Support
[INFO] DHIS External Support
[INFO] DHIS Hibernate Support
[INFO] DHIS System Support
[INFO] DHIS JDBC Service
[INFO] DHIS XML framework services
[INFO] DHIS Services Parent Project
[INFO] DHIS Core API Implementations
[INFO] DHIS I18n Static
[INFO] DHIS Options
[INFO] DHIS Administration Service
[INFO] DHIS DataMart Service - Default
[INFO] DHIS Aggregation Service - Default
[INFO] DHIS OrganisationUnit API Implementations
[INFO] DHIS Reporting Service
[INFO] DHIS Import-Export Service
[INFO] DHIS Patient API Implementations
[INFO] DHIS JDBC / External Test Project
[INFO] ------------------------------------------------------------------------
[INFO] Building DHIS 2
[INFO] task-segment: [clean, install, findbugs:findbugs]
[INFO] ------------------------------------------------------------------------
[INFO] [clean:clean {execution: default-clean}]
[INFO] [site:attach-descriptor {execution: default-attach-descriptor}]
[INFO] [install:install {execution: default-install}]
[INFO] Installing <http://dhis.uio.no/ci/job/Dhis2%20Service%20Trunk/ws/dhis-2/pom.xml> to /ifi/utgard/p01/dhis/.m2/repository/org/hisp/dhis/dhis/2.2-SNAPSHOT/dhis-2.2-SNAPSHOT.pom
[INFO] Preparing findbugs:findbugs
[INFO] No goals needed for project - skipping
[INFO] Setting property: classpath.resource.loader.class => 'org.codehaus.plexus.velocity.ContextClassLoaderResourceLoader'.
[INFO] Setting property: velocimacro.messages.on => 'false'.
[INFO] Setting property: resource.loader => 'classpath'.
[INFO] Setting property: resource.manager.logwhenfound => 'false'.
[INFO] **************************************************************
[INFO] Starting Jakarta Velocity v1.4
[INFO] RuntimeInstance initializing.
[INFO] Default Properties File: org/apache/velocity/runtime/defaults/velocity.properties
[INFO] Default ResourceManager initializing. (class org.apache.velocity.runtime.resource.ResourceManagerImpl)
[INFO] Resource Loader Instantiated: org.codehaus.plexus.velocity.ContextClassLoaderResourceLoader
[INFO] ClasspathResourceLoader : initialization starting.
[INFO] ClasspathResourceLoader : initialization complete.
[INFO] ResourceCache : initialized. (class org.apache.velocity.runtime.resource.ResourceCacheImpl)
[INFO] Default ResourceManager initialization complete.
[INFO] Loaded System Directive: org.apache.velocity.runtime.directive.Literal
[INFO] Loaded System Directive: org.apache.velocity.runtime.directive.Macro
[INFO] Loaded System Directive: org.apache.velocity.runtime.directive.Parse
[INFO] Loaded System Directive: org.apache.velocity.runtime.directive.Include
[INFO] Loaded System Directive: org.apache.velocity.runtime.directive.Foreach
[INFO] Created: 20 parsers.
[INFO] Velocimacro : initialization starting.
[INFO] Velocimacro : adding VMs from VM library template : VM_global_library.vm
[ERROR] ResourceManager : unable to find resource 'VM_global_library.vm' in any resource loader.
[INFO] Velocimacro : error using VM library template VM_global_library.vm : org.apache.velocity.exception.ResourceNotFoundException: Unable to find resource 'VM_global_library.vm'
[INFO] Velocimacro : VM library template macro registration complete.
[INFO] Velocimacro : allowInline = true : VMs can be defined inline in templates
[INFO] Velocimacro : allowInlineToOverride = false : VMs defined inline may NOT replace previous VM definitions
[INFO] Velocimacro : allowInlineLocal = false : VMs defined inline will be global in scope if allowed.
[INFO] Velocimacro : initialization complete.
[INFO] Velocity successfully started.
[INFO] [findbugs:findbugs {execution: default-cli}]
[INFO] Using source root:
[INFO] <http://dhis.uio.no/ci/job/Dhis2%20Service%20Trunk/ws/dhis-2/target/classes>
[INFO] Using test source root:
[INFO] <http://dhis.uio.no/ci/job/Dhis2%20Service%20Trunk/ws/dhis-2/target/test-classes>
[INFO] Output class directory doesn't exist. Skipping findbugs.
[HUDSON] Archiving <http://dhis.uio.no/ci/job/Dhis2%20Service%20Trunk/ws/dhis-2/pom.xml> to /ifi/utgard/p01/dhis/projects/dhis-dev.ifi.uio.no/ci/home/jobs/Dhis2 Service Trunk/modules/org.hisp.dhis$dhis/builds/2011-03-28_16-31-03/archive/org.hisp.dhis/dhis/2.2-SNAPSHOT/pom.xml
[HUDSON] Archiving /ifi/utgard/p01/dhis/.m2/repository/org/hisp/dhis/dhis/2.2-SNAPSHOT/dhis-2.2-SNAPSHOT.pom to /ifi/utgard/p01/dhis/projects/dhis-dev.ifi.uio.no/ci/home/jobs/Dhis2 Service Trunk/modules/org.hisp.dhis$dhis/builds/2011-03-28_16-31-03/archive/org.hisp.dhis/dhis/2.2-SNAPSHOT/dhis-2.2-SNAPSHOT.pom
[INFO] ------------------------------------------------------------------------
[INFO] Building DHIS API
[INFO] task-segment: [clean, install, findbugs:findbugs]
[INFO] ------------------------------------------------------------------------
[INFO] [clean:clean {execution: default-clean}]
[INFO] Deleting directory <http://dhis.uio.no/ci/job/Dhis2%20Service%20Trunk/ws/dhis-2/dhis-api/target>
[INFO] [resources:resources {execution: default-resources}]
[INFO] Using encoding: 'UTF-8' to copy filtered resources.
[INFO] [compiler:compile {execution: default-compile}]
[INFO] Compiling 330 source files to <http://dhis.uio.no/ci/job/Dhis2%20Service%20Trunk/ws/dhis-2/dhis-api/target/classes>
[INFO] [resources:testResources {execution: default-testResources}]
[INFO] Using encoding: 'UTF-8' to copy filtered resources.
[INFO] [compiler:testCompile {execution: default-testCompile}]
[INFO] Compiling 18 source files to <http://dhis.uio.no/ci/job/Dhis2%20Service%20Trunk/ws/dhis-2/dhis-api/target/test-classes>
[INFO] [surefire:test {execution: default-test}]
[INFO] Surefire report directory: <http://dhis.uio.no/ci/job/Dhis2%20Service%20Trunk/ws/dhis-2/dhis-api/target/surefire-reports>

-------------------------------------------------------
T E S T S
-------------------------------------------------------
Running org.hisp.dhis.period.YearlyPeriodTypeTest
Tests run: 4, Failures: 0, Errors: 0, Skipped: 0, Time elapsed: 0.184 sec
Running org.hisp.dhis.period.SixMonthlyPeriodTypeTest
Tests run: 4, Failures: 0, Errors: 0, Skipped: 0, Time elapsed: 0.112 sec
Running org.hisp.dhis.period.RelativePeriodTest
Tests run: 1, Failures: 0, Errors: 0, Skipped: 0, Time elapsed: 0.083 sec
Running org.hisp.dhis.dataelement.OperandTest
Tests run: 2, Failures: 0, Errors: 0, Skipped: 0, Time elapsed: 0.027 sec
Running org.hisp.dhis.organisationunit.OrganisationUnitTest
Tests run: 3, Failures: 0, Errors: 0, Skipped: 0, Time elapsed: 0.071 sec
Running org.hisp.dhis.period.FinancialAprilPeriodTypeTest
Tests run: 4, Failures: 0, Errors: 0, Skipped: 0, Time elapsed: 0.091 sec
Running org.hisp.dhis.common.CombinationGeneratorTest
Tests run: 8, Failures: 0, Errors: 0, Skipped: 0, Time elapsed: 0.057 sec
Running org.hisp.dhis.patient.PatientTest
Tests run: 1, Failures: 0, Errors: 0, Skipped: 0, Time elapsed: 0.015 sec
Running org.hisp.dhis.period.QuarterlyPeriodTypeTest
Tests run: 4, Failures: 0, Errors: 0, Skipped: 0, Time elapsed: 0.031 sec
Running org.hisp.dhis.dataelement.DataElementTest
Tests run: 2, Failures: 0, Errors: 0, Skipped: 0, Time elapsed: 0.058 sec
Running org.hisp.dhis.organisationunit.OrganisationUnitHierarchyTest
Tests run: 1, Failures: 0, Errors: 0, Skipped: 0, Time elapsed: 0.019 sec
Running org.hisp.dhis.period.MonthlyPeriodTypeTest
Tests run: 4, Failures: 0, Errors: 0, Skipped: 0, Time elapsed: 0.025 sec
Running org.hisp.dhis.period.FinancialOctoberPeriodTypeTest
Tests run: 4, Failures: 0, Errors: 0, Skipped: 0, Time elapsed: 0.03 sec
Running org.hisp.dhis.dataentryform.DataEntryFormTest
Tests run: 2, Failures: 0, Errors: 0, Skipped: 0, Time elapsed: 0.021 sec
Running org.hisp.dhis.period.WeeklyPeriodTypeTest
Tests run: 3, Failures: 0, Errors: 0, Skipped: 2, Time elapsed: 0.019 sec
Running org.hisp.dhis.period.FinancialJulyPeriodTypeTest
Tests run: 4, Failures: 0, Errors: 0, Skipped: 0, Time elapsed: 0.035 sec
Running org.hisp.dhis.period.StringFormatTest
Tests run: 1, Failures: 0, Errors: 0, Skipped: 0, Time elapsed: 0.036 sec

Results :

Tests run: 52, Failures: 0, Errors: 0, Skipped: 2

[HUDSON] Recording test results
FATAL: Failed to save the JUnit test result
java.io.IOException: Disk quota exceeded
  at java.io.FileOutputStream.close0(Native Method)
  at java.io.FileOutputStream.close(FileOutputStream.java:279)
  at sun.nio.cs.StreamEncoder.implClose(StreamEncoder.java:301)
  at sun.nio.cs.StreamEncoder.close(StreamEncoder.java:130)
  at java.io.OutputStreamWriter.close(OutputStreamWriter.java:216)
  at java.io.BufferedWriter.close(BufferedWriter.java:248)
  at hudson.util.AtomicFileWriter.close(AtomicFileWriter.java:94)
  at hudson.util.AtomicFileWriter.commit(AtomicFileWriter.java:109)
  at hudson.XmlFile.write(XmlFile.java:166)
  at hudson.tasks.junit.TestResultAction.setResult(TestResultAction.java:82)
  at hudson.tasks.junit.TestResultAction.<init>(TestResultAction.java:67)
  at hudson.maven.reporters.SurefireReport.<init>(SurefireReport.java:45)
  at hudson.maven.reporters.SurefireArchiver$1.call(SurefireArchiver.java:132)
  at hudson.maven.reporters.SurefireArchiver$1.call(SurefireArchiver.java:128)
  at hudson.maven.MavenBuild$ProxyImpl.execute(MavenBuild.java:379)
  at hudson.maven.MavenBuild$ProxyImpl2.execute(MavenBuild.java:452)
  at sun.reflect.GeneratedMethodAccessor167.invoke(Unknown Source)
  at sun.reflect.DelegatingMethodAccessorImpl.invoke(DelegatingMethodAccessorImpl.java:25)
  at java.lang.reflect.Method.invoke(Method.java:597)
  at hudson.model.Executor$1.call(Executor.java:429)
  at hudson.util.InterceptingProxy$1.invoke(InterceptingProxy.java:23)
  at $Proxy30.execute(Unknown Source)
  at sun.reflect.GeneratedMethodAccessor171.invoke(Unknown Source)
  at sun.reflect.DelegatingMethodAccessorImpl.invoke(DelegatingMethodAccessorImpl.java:25)
  at java.lang.reflect.Method.invoke(Method.java:597)
  at hudson.remoting.RemoteInvocationHandler$RPCRequest.perform(RemoteInvocationHandler.java:274)
  at hudson.remoting.RemoteInvocationHandler$RPCRequest.call(RemoteInvocationHandler.java:255)
  at hudson.remoting.RemoteInvocationHandler$RPCRequest.call(RemoteInvocationHandler.java:215)
  at hudson.remoting.UserRequest.perform(UserRequest.java:114)
  at hudson.remoting.UserRequest.perform(UserRequest.java:48)
  at hudson.remoting.Request$2.run(Request.java:270)
  at java.util.concurrent.Executors$RunnableAdapter.call(Executors.java:441)
  at java.util.concurrent.FutureTask$Sync.innerRun(FutureTask.java:303)
  at java.util.concurrent.FutureTask.run(FutureTask.java:138)
  at java.util.concurrent.ThreadPoolExecutor$Worker.runTask(ThreadPoolExecutor.java:886)
  at java.util.concurrent.ThreadPoolExecutor$Worker.run(ThreadPoolExecutor.java:908)
  at java.lang.Thread.run(Thread.java:662)
[INFO] [jar:jar {execution: default-jar}]
[HUDSON] Archiving <http://dhis.uio.no/ci/job/Dhis2%20Service%20Trunk/ws/dhis-2/dhis-api/pom.xml> to /ifi/utgard/p01/dhis/projects/dhis-dev.ifi.uio.no/ci/home/jobs/Dhis2 Service Trunk/modules/org.hisp.dhis$dhis-api/builds/2011-03-28_16-31-03/archive/org.hisp.dhis/dhis-api/2.2-SNAPSHOT/pom.xml
[INFO] ------------------------------------------------------------------------
[ERROR] BUILD ERROR
[INFO] ------------------------------------------------------------------------
[INFO] Error assembling JAR

Embedded error: Disk quota exceeded
[INFO] ------------------------------------------------------------------------
[INFO] For more information, run Maven with the -e switch
[INFO] ------------------------------------------------------------------------
[INFO] Total time: 45 seconds
[INFO] Finished at: Mon Mar 28 16:32:03 CEST 2011
[INFO] Final Memory: 39M/117M
[INFO] ------------------------------------------------------------------------
ERROR: Asynchronous execution failure
java.util.concurrent.ExecutionException: java.io.IOException: Disk quota exceeded
  at hudson.remoting.Channel$2.adapt(Channel.java:662)
  at hudson.remoting.Channel$2.adapt(Channel.java:657)
  at hudson.remoting.FutureAdapter.get(FutureAdapter.java:55)
  at hudson.maven.MavenBuilder.call(MavenBuilder.java:175)
  at hudson.maven.MavenModuleSetBuild$Builder.call(MavenModuleSetBuild.java:868)
  at hudson.maven.MavenModuleSetBuild$Builder.call(MavenModuleSetBuild.java:799)
  at hudson.remoting.UserRequest.perform(UserRequest.java:114)
  at hudson.remoting.UserRequest.perform(UserRequest.java:48)
  at hudson.remoting.Request$2.run(Request.java:270)
  at java.util.concurrent.Executors$RunnableAdapter.call(Executors.java:441)
  at java.util.concurrent.FutureTask$Sync.innerRun(FutureTask.java:303)
  at java.util.concurrent.FutureTask.run(FutureTask.java:138)
  at java.util.concurrent.ThreadPoolExecutor$Worker.runTask(ThreadPoolExecutor.java:886)
  at java.util.concurrent.ThreadPoolExecutor$Worker.run(ThreadPoolExecutor.java:908)
  at java.lang.Thread.run(Thread.java:662)
Caused by: java.io.IOException: Disk quota exceeded
  at java.io.FileOutputStream.close0(Native Method)
  at java.io.FileOutputStream.close(FileOutputStream.java:279)
  at sun.nio.cs.StreamEncoder.implClose(StreamEncoder.java:301)
  at sun.nio.cs.StreamEncoder.close(StreamEncoder.java:130)
  at java.io.OutputStreamWriter.close(OutputStreamWriter.java:216)
  at java.io.BufferedWriter.close(BufferedWriter.java:248)
  at hudson.util.AtomicFileWriter.close(AtomicFileWriter.java:94)
  at hudson.util.AtomicFileWriter.commit(AtomicFileWriter.java:109)
  at hudson.XmlFile.write(XmlFile.java:166)
  at hudson.model.Fingerprint.save(Fingerprint.java:704)
  at hudson.model.Fingerprint.add(Fingerprint.java:666)
  at hudson.model.Fingerprint.add(Fingerprint.java:651)
  at hudson.maven.reporters.MavenFingerprinter$1.call(MavenFingerprinter.java:105)
  at hudson.maven.reporters.MavenFingerprinter$1.call(MavenFingerprinter.java:96)
  at hudson.maven.MavenBuild$ProxyImpl.execute(MavenBuild.java:379)
  at hudson.maven.MavenBuild$ProxyImpl2.execute(MavenBuild.java:452)
  at sun.reflect.GeneratedMethodAccessor167.invoke(Unknown Source)
  at sun.reflect.DelegatingMethodAccessorImpl.invoke(DelegatingMethodAccessorImpl.java:25)
  at java.lang.reflect.Method.invoke(Method.java:597)
  at hudson.model.Executor$1.call(Executor.java:429)
  at hudson.util.InterceptingProxy$1.invoke(InterceptingProxy.java:23)
  at $Proxy30.execute(Unknown Source)
  at hudson.maven.MavenBuildProxy$Filter$AsyncInvoker.call(MavenBuildProxy.java:263)
  ... 9 more
Sending e-mails to: dhis2-devs@lists.launchpad.net
channel stopped

See <http://dhis.uio.no/ci/job/Dhis2%20Service%20Trunk/2355/changes>