Build failed in Jenkins: Dhis2 Service Trunk #2233

See <http://dhis.uio.no/ci/job/Dhis2%20Service%20Trunk/2233/changes>

Changes:

[Lars Helge Overland] Removed DataEntryFormDeletionHandler, no point since DataSet-DataEntryForm is cascading in db

[Lars Helge Overland] Fixed bug 734691 related to storing of zero datavalue gui

···

------------------------------------------
[...truncated 206 lines...]
[INFO] Output class directory doesn't exist. Skipping findbugs.
[HUDSON] Archiving <http://dhis.uio.no/ci/job/Dhis2%20Service%20Trunk/ws/dhis-2/dhis-support/pom.xml> to /ifi/utgard/p01/dhis/projects/dhis-dev.ifi.uio.no/ci/home/jobs/Dhis2 Service Trunk/modules/org.hisp.dhis$dhis-support/builds/2011-03-14_21-31-09/archive/org.hisp.dhis/dhis-support/2.2-SNAPSHOT/pom.xml
[HUDSON] Archiving /ifi/utgard/p01/dhis/.m2/repository/org/hisp/dhis/dhis-support/2.2-SNAPSHOT/dhis-support-2.2-SNAPSHOT.pom to /ifi/utgard/p01/dhis/projects/dhis-dev.ifi.uio.no/ci/home/jobs/Dhis2 Service Trunk/modules/org.hisp.dhis$dhis-support/builds/2011-03-14_21-31-09/archive/org.hisp.dhis/dhis-support/2.2-SNAPSHOT/dhis-support-2.2-SNAPSHOT.pom
[INFO] ------------------------------------------------------------------------
[INFO] Building DHIS Test Support
[INFO] task-segment: [clean, install, findbugs:findbugs]
[INFO] ------------------------------------------------------------------------
[INFO] [clean:clean {execution: default-clean}]
[INFO] Deleting directory <http://dhis.uio.no/ci/job/Dhis2%20Service%20Trunk/ws/dhis-2/dhis-support/dhis-support-test/target>
[INFO] [resources:resources {execution: default-resources}]
[INFO] Using encoding: 'UTF-8' to copy filtered resources.
[INFO] [compiler:compile {execution: default-compile}]
[INFO] Compiling 7 source files to <http://dhis.uio.no/ci/job/Dhis2%20Service%20Trunk/ws/dhis-2/dhis-support/dhis-support-test/target/classes>
[HUDSON] Recording test results[INFO] [resources:testResources {execution: default-testResources}]
[INFO] Using encoding: 'UTF-8' to copy filtered resources.

[INFO] [compiler:testCompile {execution: default-testCompile}]
[INFO] No sources to compile
[INFO] [surefire:test {execution: default-test}]
[INFO] No tests to run.
[INFO] [jar:jar {execution: default-jar}]
[INFO] Building jar: <http://dhis.uio.no/ci/job/Dhis2%20Service%20Trunk/ws/dhis-2/dhis-support/dhis-support-test/target/dhis-support-test-2.2-SNAPSHOT.jar>
[INFO] [install:install {execution: default-install}]
[INFO] Installing <http://dhis.uio.no/ci/job/Dhis2%20Service%20Trunk/ws/dhis-2/dhis-support/dhis-support-test/target/dhis-support-test-2.2-SNAPSHOT.jar> to /ifi/utgard/p01/dhis/.m2/repository/org/hisp/dhis/dhis-support-test/2.2-SNAPSHOT/dhis-support-test-2.2-SNAPSHOT.jar
[INFO] Preparing findbugs:findbugs
[HUDSON] Archiving <http://dhis.uio.no/ci/job/Dhis2%20Service%20Trunk/ws/dhis-2/dhis-support/dhis-support-test/pom.xml> to /ifi/utgard/p01/dhis/projects/dhis-dev.ifi.uio.no/ci/home/jobs/Dhis2 Service Trunk/modules/org.hisp.dhis$dhis-support-test/builds/2011-03-14_21-31-09/archive/org.hisp.dhis/dhis-support-test/2.2-SNAPSHOT/pom.xml
[HUDSON] Archiving <http://dhis.uio.no/ci/job/Dhis2%20Service%20Trunk/ws/dhis-2/dhis-support/dhis-support-test/target/dhis-support-test-2.2-SNAPSHOT.jar> to /ifi/utgard/p01/dhis/projects/dhis-dev.ifi.uio.no/ci/home/jobs/Dhis2 Service Trunk/modules/org.hisp.dhis$dhis-support-test/builds/2011-03-14_21-31-09/archive/org.hisp.dhis/dhis-support-test/2.2-SNAPSHOT/dhis-support-test-2.2-SNAPSHOT.jar
[INFO] [resources:resources {execution: default-resources}]
[INFO] Using encoding: 'UTF-8' to copy filtered resources.
[INFO] [compiler:compile {execution: default-compile}]
[INFO] Nothing to compile - all classes are up to date
[INFO] [findbugs:findbugs {execution: default-cli}]
[INFO] Using source root:
[INFO] <http://dhis.uio.no/ci/job/Dhis2%20Service%20Trunk/ws/dhis-2/dhis-support/dhis-support-test/target/classes>
[INFO] Using test source root:
[INFO] <http://dhis.uio.no/ci/job/Dhis2%20Service%20Trunk/ws/dhis-2/dhis-support/dhis-support-test/target/test-classes>
[INFO] No effort provided, using default effort.
[INFO] Adding Source Directory: <http://dhis.uio.no/ci/job/Dhis2%20Service%20Trunk/ws/dhis-2/dhis-support/dhis-support-test/src/main/java>
[INFO] No threshold provided, using default threshold.
[INFO] Using FindBugs Version: 1.3.8
[INFO] No threshold provided, using default threshold.
[INFO] No threshold provided, using default threshold.
[INFO] No threshold provided, using default threshold.
[INFO] Using the xdoc format
[INFO] No effort provided, using default effort.
[INFO] No threshold provided, using default threshold.
[INFO] No threshold provided, using default threshold.
[INFO] Debugging is Off
[INFO] No bug include filter.
[INFO] Using bug exclude filter /tmp/plexus-resources1590828253tmp
[FINDBUGS] Skipping file DHIS Test Support of module <http://dhis.uio.no/ci/job/Dhis2%20Service%20Trunk/ws/dhis-2/dhis-support/dhis-support-test/target/findbugsXml.xml> because it's empty.
[INFO] Printing Errors
[INFO] Printing Missing classes
[INFO] Printing Source Roots
[INFO] ------------------------------------------------------------------------
[INFO] Building DHIS External Support
[INFO] task-segment: [clean, install, findbugs:findbugs]
[INFO] ------------------------------------------------------------------------
[INFO] [clean:clean {execution: default-clean}]
[INFO] Deleting directory <http://dhis.uio.no/ci/job/Dhis2%20Service%20Trunk/ws/dhis-2/dhis-support/dhis-support-external/target>
[INFO] [resources:resources {execution: default-resources}]
[INFO] Using encoding: 'UTF-8' to copy filtered resources.
[INFO] [compiler:compile {execution: default-compile}]
[INFO] Compiling 3 source files to <http://dhis.uio.no/ci/job/Dhis2%20Service%20Trunk/ws/dhis-2/dhis-support/dhis-support-external/target/classes>
[HUDSON] Archiving <http://dhis.uio.no/ci/job/Dhis2%20Service%20Trunk/ws/dhis-2/dhis-support/dhis-support-external/pom.xml> to /ifi/utgard/p01/dhis/projects/dhis-dev.ifi.uio.no/ci/home/jobs/Dhis2 Service Trunk/modules/org.hisp.dhis$dhis-support-external/builds/2011-03-14_21-31-09/archive/org.hisp.dhis/dhis-support-external/2.2-SNAPSHOT/pom.xml
[INFO] ------------------------------------------------------------------------
[ERROR] BUILD FAILURE
[INFO] ------------------------------------------------------------------------
[INFO] Compilation failure
<http://dhis.uio.no/ci/job/Dhis2%20Service%20Trunk/ws/dhis-2/dhis-support/dhis-support-external/src/main/java/org/hisp/dhis/external/location/DefaultLocationManagerResolver.java>:[44,7] error while writing org.hisp.dhis.external.location.DefaultLocationManagerResolver: Disk quota exceeded

[INFO] ------------------------------------------------------------------------
[INFO] For more information, run Maven with the -e switch
[INFO] ------------------------------------------------------------------------
[INFO] Total time: 3 minutes 6 seconds
[INFO] Finished at: Mon Mar 14 21:34:28 CET 2011
[INFO] Final Memory: 58M/186M
[INFO] ------------------------------------------------------------------------
ERROR: Asynchronous execution failure
java.util.concurrent.ExecutionException: java.io.IOException: Disk quota exceeded
  at hudson.remoting.Channel$2.adapt(Channel.java:662)
  at hudson.remoting.Channel$2.adapt(Channel.java:657)
  at hudson.remoting.FutureAdapter.get(FutureAdapter.java:55)
  at hudson.maven.MavenBuilder.call(MavenBuilder.java:175)
  at hudson.maven.MavenModuleSetBuild$Builder.call(MavenModuleSetBuild.java:868)
  at hudson.maven.MavenModuleSetBuild$Builder.call(MavenModuleSetBuild.java:799)
  at hudson.remoting.UserRequest.perform(UserRequest.java:114)
  at hudson.remoting.UserRequest.perform(UserRequest.java:48)
  at hudson.remoting.Request$2.run(Request.java:270)
  at java.util.concurrent.Executors$RunnableAdapter.call(Executors.java:441)
  at java.util.concurrent.FutureTask$Sync.innerRun(FutureTask.java:303)
  at java.util.concurrent.FutureTask.run(FutureTask.java:138)
  at java.util.concurrent.ThreadPoolExecutor$Worker.runTask(ThreadPoolExecutor.java:886)
  at java.util.concurrent.ThreadPoolExecutor$Worker.run(ThreadPoolExecutor.java:908)
  at java.lang.Thread.run(Thread.java:662)
Caused by: java.io.IOException: Disk quota exceeded
  at java.io.FileOutputStream.close0(Native Method)
  at java.io.FileOutputStream.close(FileOutputStream.java:279)
  at sun.nio.cs.StreamEncoder.implClose(StreamEncoder.java:301)
  at sun.nio.cs.StreamEncoder.close(StreamEncoder.java:130)
  at java.io.OutputStreamWriter.close(OutputStreamWriter.java:216)
  at java.io.BufferedWriter.close(BufferedWriter.java:248)
  at hudson.util.AtomicFileWriter.close(AtomicFileWriter.java:94)
  at hudson.util.AtomicFileWriter.commit(AtomicFileWriter.java:109)
  at hudson.XmlFile.write(XmlFile.java:166)
  at hudson.model.Fingerprint.save(Fingerprint.java:704)
  at hudson.model.Fingerprint.add(Fingerprint.java:666)
  at hudson.model.Fingerprint.add(Fingerprint.java:651)
  at hudson.maven.reporters.MavenFingerprinter$1.call(MavenFingerprinter.java:105)
  at hudson.maven.reporters.MavenFingerprinter$1.call(MavenFingerprinter.java:96)
  at hudson.maven.MavenBuild$ProxyImpl.execute(MavenBuild.java:379)
  at hudson.maven.MavenBuild$ProxyImpl2.execute(MavenBuild.java:452)
  at sun.reflect.GeneratedMethodAccessor167.invoke(Unknown Source)
  at sun.reflect.DelegatingMethodAccessorImpl.invoke(DelegatingMethodAccessorImpl.java:25)
  at java.lang.reflect.Method.invoke(Method.java:597)
  at hudson.model.Executor$1.call(Executor.java:429)
  at hudson.util.InterceptingProxy$1.invoke(InterceptingProxy.java:23)
  at $Proxy30.execute(Unknown Source)
  at hudson.maven.MavenBuildProxy$Filter$AsyncInvoker.call(MavenBuildProxy.java:263)
  ... 9 more
ERROR: Asynchronous execution failure
java.util.concurrent.ExecutionException: java.io.IOException: Disk quota exceeded
  at hudson.remoting.Channel$2.adapt(Channel.java:662)
  at hudson.remoting.Channel$2.adapt(Channel.java:657)
  at hudson.remoting.FutureAdapter.get(FutureAdapter.java:55)
  at hudson.maven.MavenBuilder.call(MavenBuilder.java:175)
  at hudson.maven.MavenModuleSetBuild$Builder.call(MavenModuleSetBuild.java:868)
  at hudson.maven.MavenModuleSetBuild$Builder.call(MavenModuleSetBuild.java:799)
  at hudson.remoting.UserRequest.perform(UserRequest.java:114)
  at hudson.remoting.UserRequest.perform(UserRequest.java:48)
  at hudson.remoting.Request$2.run(Request.java:270)
  at java.util.concurrent.Executors$RunnableAdapter.call(Executors.java:441)
  at java.util.concurrent.FutureTask$Sync.innerRun(FutureTask.java:303)
  at java.util.concurrent.FutureTask.run(FutureTask.java:138)
  at java.util.concurrent.ThreadPoolExecutor$Worker.runTask(ThreadPoolExecutor.java:886)
  at java.util.concurrent.ThreadPoolExecutor$Worker.run(ThreadPoolExecutor.java:908)
  at java.lang.Thread.run(Thread.java:662)
Caused by: java.io.IOException: Disk quota exceeded
  at java.io.FileOutputStream.close0(Native Method)
  at java.io.FileOutputStream.close(FileOutputStream.java:279)
  at sun.nio.cs.StreamEncoder.implClose(StreamEncoder.java:301)
  at sun.nio.cs.StreamEncoder.close(StreamEncoder.java:130)
  at java.io.OutputStreamWriter.close(OutputStreamWriter.java:216)
  at java.io.BufferedWriter.close(BufferedWriter.java:248)
  at hudson.util.AtomicFileWriter.close(AtomicFileWriter.java:94)
  at hudson.util.AtomicFileWriter.commit(AtomicFileWriter.java:109)
  at hudson.XmlFile.write(XmlFile.java:166)
  at hudson.model.Fingerprint.save(Fingerprint.java:704)
  at hudson.model.Fingerprint.add(Fingerprint.java:666)
  at hudson.model.Fingerprint.add(Fingerprint.java:651)
  at hudson.maven.reporters.MavenFingerprinter$1.call(MavenFingerprinter.java:105)
  at hudson.maven.reporters.MavenFingerprinter$1.call(MavenFingerprinter.java:96)
  at hudson.maven.MavenBuild$ProxyImpl.execute(MavenBuild.java:379)
  at hudson.maven.MavenBuild$ProxyImpl2.execute(MavenBuild.java:452)
  at sun.reflect.GeneratedMethodAccessor167.invoke(Unknown Source)
  at sun.reflect.DelegatingMethodAccessorImpl.invoke(DelegatingMethodAccessorImpl.java:25)
  at java.lang.reflect.Method.invoke(Method.java:597)
  at hudson.model.Executor$1.call(Executor.java:429)
  at hudson.util.InterceptingProxy$1.invoke(InterceptingProxy.java:23)
  at $Proxy30.execute(Unknown Source)
  at hudson.maven.MavenBuildProxy$Filter$AsyncInvoker.call(MavenBuildProxy.java:263)
  ... 9 more
ERROR: Asynchronous execution failure
java.util.concurrent.ExecutionException: java.io.IOException: Disk quota exceeded
  at hudson.remoting.Channel$2.adapt(Channel.java:662)
  at hudson.remoting.Channel$2.adapt(Channel.java:657)
  at hudson.remoting.FutureAdapter.get(FutureAdapter.java:55)
  at hudson.maven.MavenBuilder.call(MavenBuilder.java:175)
  at hudson.maven.MavenModuleSetBuild$Builder.call(MavenModuleSetBuild.java:868)
  at hudson.maven.MavenModuleSetBuild$Builder.call(MavenModuleSetBuild.java:799)
  at hudson.remoting.UserRequest.perform(UserRequest.java:114)
  at hudson.remoting.UserRequest.perform(UserRequest.java:48)
  at hudson.remoting.Request$2.run(Request.java:270)
  at java.util.concurrent.Executors$RunnableAdapter.call(Executors.java:441)
  at java.util.concurrent.FutureTask$Sync.innerRun(FutureTask.java:303)
  at java.util.concurrent.FutureTask.run(FutureTask.java:138)
  at java.util.concurrent.ThreadPoolExecutor$Worker.runTask(ThreadPoolExecutor.java:886)
  at java.util.concurrent.ThreadPoolExecutor$Worker.run(ThreadPoolExecutor.java:908)
  at java.lang.Thread.run(Thread.java:662)
Caused by: java.io.IOException: Disk quota exceeded
  at java.io.FileOutputStream.close0(Native Method)
  at java.io.FileOutputStream.close(FileOutputStream.java:279)
  at sun.nio.cs.StreamEncoder.implClose(StreamEncoder.java:301)
  at sun.nio.cs.StreamEncoder.close(StreamEncoder.java:130)
  at java.io.OutputStreamWriter.close(OutputStreamWriter.java:216)
  at java.io.BufferedWriter.close(BufferedWriter.java:248)
  at hudson.util.AtomicFileWriter.close(AtomicFileWriter.java:94)
  at hudson.util.AtomicFileWriter.commit(AtomicFileWriter.java:109)
  at hudson.XmlFile.write(XmlFile.java:166)
  at hudson.model.Fingerprint.save(Fingerprint.java:704)
  at hudson.model.Fingerprint.add(Fingerprint.java:666)
  at hudson.model.Fingerprint.add(Fingerprint.java:651)
  at hudson.maven.reporters.MavenFingerprinter$1.call(MavenFingerprinter.java:107)
  at hudson.maven.reporters.MavenFingerprinter$1.call(MavenFingerprinter.java:96)
  at hudson.maven.MavenBuild$ProxyImpl.execute(MavenBuild.java:379)
  at hudson.maven.MavenBuild$ProxyImpl2.execute(MavenBuild.java:452)
  at sun.reflect.GeneratedMethodAccessor167.invoke(Unknown Source)
  at sun.reflect.DelegatingMethodAccessorImpl.invoke(DelegatingMethodAccessorImpl.java:25)
  at java.lang.reflect.Method.invoke(Method.java:597)
  at hudson.model.Executor$1.call(Executor.java:429)
  at hudson.util.InterceptingProxy$1.invoke(InterceptingProxy.java:23)
  at $Proxy30.execute(Unknown Source)
  at hudson.maven.MavenBuildProxy$Filter$AsyncInvoker.call(MavenBuildProxy.java:263)
  ... 9 more
ERROR: Asynchronous execution failure
java.util.concurrent.ExecutionException: java.io.IOException: Disk quota exceeded
  at hudson.remoting.Channel$2.adapt(Channel.java:662)
  at hudson.remoting.Channel$2.adapt(Channel.java:657)
  at hudson.remoting.FutureAdapter.get(FutureAdapter.java:55)
  at hudson.maven.MavenBuilder.call(MavenBuilder.java:175)
  at hudson.maven.MavenModuleSetBuild$Builder.call(MavenModuleSetBuild.java:868)
  at hudson.maven.MavenModuleSetBuild$Builder.call(MavenModuleSetBuild.java:799)
  at hudson.remoting.UserRequest.perform(UserRequest.java:114)
  at hudson.remoting.UserRequest.perform(UserRequest.java:48)
  at hudson.remoting.Request$2.run(Request.java:270)
  at java.util.concurrent.Executors$RunnableAdapter.call(Executors.java:441)
  at java.util.concurrent.FutureTask$Sync.innerRun(FutureTask.java:303)
  at java.util.concurrent.FutureTask.run(FutureTask.java:138)
  at java.util.concurrent.ThreadPoolExecutor$Worker.runTask(ThreadPoolExecutor.java:886)
  at java.util.concurrent.ThreadPoolExecutor$Worker.run(ThreadPoolExecutor.java:908)
  at java.lang.Thread.run(Thread.java:662)
Caused by: java.io.IOException: Disk quota exceeded
  at java.io.FileOutputStream.close0(Native Method)
  at java.io.FileOutputStream.close(FileOutputStream.java:279)
  at sun.nio.cs.StreamEncoder.implClose(StreamEncoder.java:301)
  at sun.nio.cs.StreamEncoder.close(StreamEncoder.java:130)
  at java.io.OutputStreamWriter.close(OutputStreamWriter.java:216)
  at java.io.BufferedWriter.close(BufferedWriter.java:248)
  at hudson.util.AtomicFileWriter.close(AtomicFileWriter.java:94)
  at hudson.util.AtomicFileWriter.commit(AtomicFileWriter.java:109)
  at hudson.XmlFile.write(XmlFile.java:166)
  at hudson.model.Fingerprint.save(Fingerprint.java:704)
  at hudson.model.Fingerprint.add(Fingerprint.java:666)
  at hudson.model.Fingerprint.add(Fingerprint.java:651)
  at hudson.maven.reporters.MavenFingerprinter$1.call(MavenFingerprinter.java:105)
  at hudson.maven.reporters.MavenFingerprinter$1.call(MavenFingerprinter.java:96)
  at hudson.maven.MavenBuild$ProxyImpl.execute(MavenBuild.java:379)
  at hudson.maven.MavenBuild$ProxyImpl2.execute(MavenBuild.java:452)
  at sun.reflect.GeneratedMethodAccessor167.invoke(Unknown Source)
  at sun.reflect.DelegatingMethodAccessorImpl.invoke(DelegatingMethodAccessorImpl.java:25)
  at java.lang.reflect.Method.invoke(Method.java:597)
  at hudson.model.Executor$1.call(Executor.java:429)
  at hudson.util.InterceptingProxy$1.invoke(InterceptingProxy.java:23)
  at $Proxy30.execute(Unknown Source)
  at hudson.maven.MavenBuildProxy$Filter$AsyncInvoker.call(MavenBuildProxy.java:263)
  ... 9 more
Sending e-mails to: dhis2-devs@lists.launchpad.net
channel stopped

See <http://dhis.uio.no/ci/job/Dhis2%20Service%20Trunk/2234/changes>