# Build failed in Jenkins: dhis-service-2.0.6 » DHIS Test Support #164

**URL:** <https://community.dhis2.org/t/build-failed-in-jenkins-dhis-service-2-0-6-dhis-test-support-164/10596>\
**Category:** Support - Assistance technique\
**Created:** [27 February 2011 22:04 UTC](https://community.dhis2.org/t/build-failed-in-jenkins-dhis-service-2-0-6-dhis-test-support-164/10596 "2011-02-27T22:04:33Z")\
**Posts on this page:** 2\
**Page:** 1

<div class="post-metadata">

**Author:** ![Support1](https://dhis2.b-cdn.net/letter_avatar_proxy/v4/letter/s/94ad74/32.png) [@Support1](https://community.dhis2.org/u/Support1)\
**Post date:** [27 February 2011 22:04 UTC](https://community.dhis2.org/t/build-failed-in-jenkins-dhis-service-2-0-6-dhis-test-support-164/10596/1 "2011-02-27T22:04:33Z")

</div>

See \<[DHIS2 App Hub](http://dhis.uio.no/ci/job/dhis-service-2.0.6/org.hisp.dhis$dhis-support-test/164/&gt);

> **···**
>
> ------------------------------------------  
> [INFO] ------------------------------------------------------------------------  
> [INFO] Building DHIS Support Parent Project  
> [INFO] task-segment: [clean, install, findbugs:findbugs]  
> [INFO] ------------------------------------------------------------------------  
> [INFO] [clean:clean {execution: default-clean}]  
> [INFO] [site:attach-descriptor {execution: default-attach-descriptor}]  
> [INFO] [install:install {execution: default-install}]  
> [INFO] Installing /ifi/utgard/p01/dhis/projects/dhis-dev.ifi.uio.no/ci/home/jobs/dhis-service-2.0.6/workspace/dhis-2/dhis-support/pom.xml to /ifi/utgard/p01/dhis/.m2/repository/org/hisp/dhis/dhis-support/2.0.6/dhis-support-2.0.6.pom  
> [INFO] Preparing findbugs:findbugs  
> [INFO] No goals needed for project - skipping  
> [INFO] [findbugs:findbugs {execution: default-cli}]  
> [INFO] Using source root:  
> [INFO] /ifi/utgard/p01/dhis/projects/dhis-dev.ifi.uio.no/ci/home/jobs/dhis-service-2.0.6/workspace/dhis-2/dhis-support/target/classes  
> [INFO] Using test source root:  
> [INFO] /ifi/utgard/p01/dhis/projects/dhis-dev.ifi.uio.no/ci/home/jobs/dhis-service-2.0.6/workspace/dhis-2/dhis-support/target/test-classes  
> [INFO] Output class directory doesn't exist. Skipping findbugs.  
> [INFO] ------------------------------------------------------------------------  
> [INFO] Building DHIS Test Support  
> [INFO] task-segment: [clean, install, findbugs:findbugs]  
> [INFO] ------------------------------------------------------------------------  
> [INFO] [clean:clean {execution: default-clean}]  
> [INFO] Deleting directory \<[DHIS2 App Hub](http://dhis.uio.no/ci/job/dhis-service-2.0.6/org.hisp.dhis$dhis-support-test/ws/target&gt);  
> [INFO] [resources:resources {execution: default-resources}]  
> [INFO] Using encoding: 'UTF-8' to copy filtered resources.  
> [INFO] [compiler:compile {execution: default-compile}]  
> [INFO] Compiling 7 source files to \<[DHIS2 App Hub](http://dhis.uio.no/ci/job/dhis-service-2.0.6/org.hisp.dhis$dhis-support-test/ws/target/classes&gt);  
> [HUDSON] Recording test results  
> [INFO] [resources:testResources {execution: default-testResources}]  
> [INFO] Using encoding: 'UTF-8' to copy filtered resources.  
> [INFO] [compiler:testCompile {execution: default-testCompile}]  
> [INFO] No sources to compile  
> [INFO] [surefire:test {execution: default-test}]  
> [INFO] No tests to run.  
> [INFO] [jar:jar {execution: default-jar}]  
> [INFO] Building jar: \<[DHIS2 App Hub](http://dhis.uio.no/ci/job/dhis-service-2.0.6/org.hisp.dhis$dhis-support-test/ws/target/dhis-support-test-2.0.6.jar&gt);  
> [HUDSON] Archiving \<[DHIS2 App Hub](http://dhis.uio.no/ci/job/dhis-service-2.0.6/org.hisp.dhis$dhis-support-test/ws/pom.xml&gt); to /ifi/utgard/p01/dhis/projects/dhis-dev.ifi.uio.no/ci/home/jobs/dhis-service-2.0.6/modules/org.hisp.dhis$dhis-support-test/builds/2011-02-27\_23-01-18/archive/org.hisp.dhis/dhis-support-test/2.0.6/pom.xml  
> [INFO] ------------------------------------------------------------------------  
> [ERROR] BUILD ERROR  
> [INFO] ------------------------------------------------------------------------  
> [INFO] Error assembling JAR
> 
> Embedded error: Problem creating jar: Disk quota exceeded  
> [INFO] ------------------------------------------------------------------------  
> [INFO] For more information, run Maven with the -e switch  
> [INFO] ------------------------------------------------------------------------  
> [INFO] Total time: 3 minutes 5 seconds  
> [INFO] Finished at: Sun Feb 27 23:04:31 CET 2011  
> [INFO] Final Memory: 52M/177M  
> [INFO] ------------------------------------------------------------------------  
> ERROR: Asynchronous execution failure  
> java.util.concurrent.ExecutionException: java.io.IOException: Disk quota exceeded  
> &nbsp;&nbsp;at hudson.remoting.Channel$2.adapt(Channel.java:662)  
> &nbsp;&nbsp;at hudson.remoting.Channel$2.adapt(Channel.java:657)  
> &nbsp;&nbsp;at hudson.remoting.FutureAdapter.get(FutureAdapter.java:55)  
> &nbsp;&nbsp;at hudson.maven.MavenBuilder.call(MavenBuilder.java:175)  
> &nbsp;&nbsp;at hudson.maven.MavenModuleSetBuild$Builder.call(MavenModuleSetBuild.java:868)  
> &nbsp;&nbsp;at hudson.maven.MavenModuleSetBuild$Builder.call(MavenModuleSetBuild.java:799)  
> &nbsp;&nbsp;at hudson.remoting.UserRequest.perform(UserRequest.java:114)  
> &nbsp;&nbsp;at hudson.remoting.UserRequest.perform(UserRequest.java:48)  
> &nbsp;&nbsp;at hudson.remoting.Request$2.run(Request.java:270)  
> &nbsp;&nbsp;at java.util.concurrent.Executors$RunnableAdapter.call(Executors.java:441)  
> &nbsp;&nbsp;at java.util.concurrent.FutureTask$Sync.innerRun(FutureTask.java:303)  
> &nbsp;&nbsp;at java.util.concurrent.FutureTask.run(FutureTask.java:138)  
> &nbsp;&nbsp;at java.util.concurrent.ThreadPoolExecutor$Worker.runTask(ThreadPoolExecutor.java:886)  
> &nbsp;&nbsp;at java.util.concurrent.ThreadPoolExecutor$Worker.run(ThreadPoolExecutor.java:908)  
> &nbsp;&nbsp;at java.lang.Thread.run(Thread.java:662)  
> Caused by: java.io.IOException: Disk quota exceeded  
> &nbsp;&nbsp;at java.io.FileOutputStream.close0(Native Method)  
> &nbsp;&nbsp;at java.io.FileOutputStream.close(FileOutputStream.java:279)  
> &nbsp;&nbsp;at sun.nio.cs.StreamEncoder.implClose(StreamEncoder.java:301)  
> &nbsp;&nbsp;at sun.nio.cs.StreamEncoder.close(StreamEncoder.java:130)  
> &nbsp;&nbsp;at java.io.OutputStreamWriter.close(OutputStreamWriter.java:216)  
> &nbsp;&nbsp;at java.io.BufferedWriter.close(BufferedWriter.java:248)  
> &nbsp;&nbsp;at hudson.util.AtomicFileWriter.close(AtomicFileWriter.java:94)  
> &nbsp;&nbsp;at hudson.util.AtomicFileWriter.commit(AtomicFileWriter.java:109)  
> &nbsp;&nbsp;at hudson.XmlFile.write(XmlFile.java:166)  
> &nbsp;&nbsp;at hudson.model.Fingerprint.save(Fingerprint.java:704)  
> &nbsp;&nbsp;at hudson.model.Fingerprint.add(Fingerprint.java:666)  
> &nbsp;&nbsp;at hudson.model.Fingerprint.add(Fingerprint.java:651)  
> &nbsp;&nbsp;at hudson.maven.reporters.MavenFingerprinter$1.call(MavenFingerprinter.java:107)  
> &nbsp;&nbsp;at hudson.maven.reporters.MavenFingerprinter$1.call(MavenFingerprinter.java:96)  
> &nbsp;&nbsp;at hudson.maven.MavenBuild$ProxyImpl.execute(MavenBuild.java:379)  
> &nbsp;&nbsp;at hudson.maven.MavenBuild$ProxyImpl2.execute(MavenBuild.java:452)  
> &nbsp;&nbsp;at sun.reflect.GeneratedMethodAccessor61.invoke(Unknown Source)  
> &nbsp;&nbsp;at sun.reflect.DelegatingMethodAccessorImpl.invoke(DelegatingMethodAccessorImpl.java:25)  
> &nbsp;&nbsp;at java.lang.reflect.Method.invoke(Method.java:597)  
> &nbsp;&nbsp;at hudson.model.Executor$1.call(Executor.java:429)  
> &nbsp;&nbsp;at hudson.util.InterceptingProxy$1.invoke(InterceptingProxy.java:23)  
> &nbsp;&nbsp;at $Proxy28.execute(Unknown Source)  
> &nbsp;&nbsp;at hudson.maven.MavenBuildProxy$Filter$AsyncInvoker.call(MavenBuildProxy.java:263)  
> &nbsp;&nbsp;... 9 more  
> ERROR: Asynchronous execution failure  
> java.util.concurrent.ExecutionException: java.io.IOException: Disk quota exceeded  
> &nbsp;&nbsp;at hudson.remoting.Channel$2.adapt(Channel.java:662)  
> &nbsp;&nbsp;at hudson.remoting.Channel$2.adapt(Channel.java:657)  
> &nbsp;&nbsp;at hudson.remoting.FutureAdapter.get(FutureAdapter.java:55)  
> &nbsp;&nbsp;at hudson.maven.MavenBuilder.call(MavenBuilder.java:175)  
> &nbsp;&nbsp;at hudson.maven.MavenModuleSetBuild$Builder.call(MavenModuleSetBuild.java:868)  
> &nbsp;&nbsp;at hudson.maven.MavenModuleSetBuild$Builder.call(MavenModuleSetBuild.java:799)  
> &nbsp;&nbsp;at hudson.remoting.UserRequest.perform(UserRequest.java:114)  
> &nbsp;&nbsp;at hudson.remoting.UserRequest.perform(UserRequest.java:48)  
> &nbsp;&nbsp;at hudson.remoting.Request$2.run(Request.java:270)  
> &nbsp;&nbsp;at java.util.concurrent.Executors$RunnableAdapter.call(Executors.java:441)  
> &nbsp;&nbsp;at java.util.concurrent.FutureTask$Sync.innerRun(FutureTask.java:303)  
> &nbsp;&nbsp;at java.util.concurrent.FutureTask.run(FutureTask.java:138)  
> &nbsp;&nbsp;at java.util.concurrent.ThreadPoolExecutor$Worker.runTask(ThreadPoolExecutor.java:886)  
> &nbsp;&nbsp;at java.util.concurrent.ThreadPoolExecutor$Worker.run(ThreadPoolExecutor.java:908)  
> &nbsp;&nbsp;at java.lang.Thread.run(Thread.java:662)  
> Caused by: java.io.IOException: Disk quota exceeded  
> &nbsp;&nbsp;at java.io.FileOutputStream.close0(Native Method)  
> &nbsp;&nbsp;at java.io.FileOutputStream.close(FileOutputStream.java:279)  
> &nbsp;&nbsp;at sun.nio.cs.StreamEncoder.implClose(StreamEncoder.java:301)  
> &nbsp;&nbsp;at sun.nio.cs.StreamEncoder.close(StreamEncoder.java:130)  
> &nbsp;&nbsp;at java.io.OutputStreamWriter.close(OutputStreamWriter.java:216)  
> &nbsp;&nbsp;at java.io.BufferedWriter.close(BufferedWriter.java:248)  
> &nbsp;&nbsp;at hudson.util.AtomicFileWriter.close(AtomicFileWriter.java:94)  
> &nbsp;&nbsp;at hudson.util.AtomicFileWriter.commit(AtomicFileWriter.java:109)  
> &nbsp;&nbsp;at hudson.XmlFile.write(XmlFile.java:166)  
> &nbsp;&nbsp;at hudson.model.Fingerprint.save(Fingerprint.java:704)  
> &nbsp;&nbsp;at hudson.model.Fingerprint.add(Fingerprint.java:666)  
> &nbsp;&nbsp;at hudson.model.Fingerprint.add(Fingerprint.java:651)  
> &nbsp;&nbsp;at hudson.maven.reporters.MavenFingerprinter$1.call(MavenFingerprinter.java:107)  
> &nbsp;&nbsp;at hudson.maven.reporters.MavenFingerprinter$1.call(MavenFingerprinter.java:96)  
> &nbsp;&nbsp;at hudson.maven.MavenBuild$ProxyImpl.execute(MavenBuild.java:379)  
> &nbsp;&nbsp;at hudson.maven.MavenBuild$ProxyImpl2.execute(MavenBuild.java:452)  
> &nbsp;&nbsp;at sun.reflect.GeneratedMethodAccessor61.invoke(Unknown Source)  
> &nbsp;&nbsp;at sun.reflect.DelegatingMethodAccessorImpl.invoke(DelegatingMethodAccessorImpl.java:25)  
> &nbsp;&nbsp;at java.lang.reflect.Method.invoke(Method.java:597)  
> &nbsp;&nbsp;at hudson.model.Executor$1.call(Executor.java:429)  
> &nbsp;&nbsp;at hudson.util.InterceptingProxy$1.invoke(InterceptingProxy.java:23)  
> &nbsp;&nbsp;at $Proxy28.execute(Unknown Source)  
> &nbsp;&nbsp;at hudson.maven.MavenBuildProxy$Filter$AsyncInvoker.call(MavenBuildProxy.java:263)  
> &nbsp;&nbsp;... 9 more

---

<div class="post-metadata">

**Author:** ![Support1](https://dhis2.b-cdn.net/letter_avatar_proxy/v4/letter/s/94ad74/32.png) [@Support1](https://community.dhis2.org/u/Support1)\
**Post date:** [1 March 2011 13:18 UTC](https://community.dhis2.org/t/build-failed-in-jenkins-dhis-service-2-0-6-dhis-test-support-164/10596/2 "2011-03-01T13:18:37Z")

</div>

See \<[DHIS2 App Hub](http://dhis.uio.no/ci/job/dhis-service-2.0.6/org.hisp.dhis$dhis-support-test/165/&gt);
