Build failed in Hudson: Dhis2 Web Trunk » DHIS Validation Rule #532

See <http://dhis.uio.no/ci/job/Dhis2%20Web%20Trunk/org.hisp.dhis$dhis-web-validationrule/532/>

···

------------------------------------------
[INFO] ------------------------------------------------------------------------
[INFO] Building DHIS Validation Rule
[INFO] task-segment: [clean, install, findbugs:findbugs]
[INFO] ------------------------------------------------------------------------
[INFO] [clean:clean {execution: default-clean}]
[INFO] Deleting directory <http://dhis.uio.no/ci/job/Dhis2%20Web%20Trunk/org.hisp.dhis$dhis-web-validationrule/ws/target>
[INFO] [resources:resources {execution: default-resources}]
[INFO] Using encoding: 'UTF-8' to copy filtered resources.
[INFO] [compiler:compile {execution: default-compile}]
[INFO] Compiling 28 source files to <http://dhis.uio.no/ci/job/Dhis2%20Web%20Trunk/org.hisp.dhis$dhis-web-validationrule/ws/target/classes>
[HUDSON] Archiving <http://dhis.uio.no/ci/job/Dhis2%20Web%20Trunk/org.hisp.dhis$dhis-web-validationrule/ws/pom.xml> to /ifi/utgard/p01/dhis/projects/dhis-dev.ifi.uio.no/ci/home/jobs/Dhis2 Web Trunk/modules/org.hisp.dhis$dhis-web-validationrule/builds/2010-04-07_16-11-29/archive/org.hisp.dhis/dhis-web-validationrule/2.0.4-SNAPSHOT/pom.xml
[INFO] ------------------------------------------------------------------------
[ERROR] BUILD FAILURE
[INFO] ------------------------------------------------------------------------

See <http://dhis.uio.no/ci/job/Dhis2%20Web%20Trunk/org.hisp.dhis$dhis-web-validationrule/533/>

···

------------------------------------------
[INFO] ------------------------------------------------------------------------
[INFO] Building DHIS Validation Rule
[INFO] task-segment: [clean, install, findbugs:findbugs]
[INFO] ------------------------------------------------------------------------
[INFO] [clean:clean {execution: default-clean}]
[INFO] Deleting directory <http://dhis.uio.no/ci/job/Dhis2%20Web%20Trunk/org.hisp.dhis$dhis-web-validationrule/ws/target>
[INFO] [resources:resources {execution: default-resources}]
[INFO] Using encoding: 'UTF-8' to copy filtered resources.
[INFO] [compiler:compile {execution: default-compile}]
[INFO] Compiling 28 source files to <http://dhis.uio.no/ci/job/Dhis2%20Web%20Trunk/org.hisp.dhis$dhis-web-validationrule/ws/target/classes>
[HUDSON] Archiving <http://dhis.uio.no/ci/job/Dhis2%20Web%20Trunk/org.hisp.dhis$dhis-web-validationrule/ws/pom.xml> to /ifi/utgard/p01/dhis/projects/dhis-dev.ifi.uio.no/ci/home/jobs/Dhis2 Web Trunk/modules/org.hisp.dhis$dhis-web-validationrule/builds/2010-04-07_16-40-13/archive/org.hisp.dhis/dhis-web-validationrule/2.0.4-SNAPSHOT/pom.xml

See <http://dhis.uio.no/ci/job/Dhis2%20Web%20Trunk/org.hisp.dhis$dhis-web-validationrule/534/>

···

------------------------------------------
[INFO] ------------------------------------------------------------------------
[INFO] Building DHIS Validation Rule
[INFO] task-segment: [clean, install, findbugs:findbugs]
[INFO] ------------------------------------------------------------------------
[INFO] [clean:clean {execution: default-clean}]
[INFO] Deleting directory <http://dhis.uio.no/ci/job/Dhis2%20Web%20Trunk/org.hisp.dhis$dhis-web-validationrule/ws/target>
[INFO] [resources:resources {execution: default-resources}]
[INFO] Using encoding: 'UTF-8' to copy filtered resources.
[INFO] [compiler:compile {execution: default-compile}]
[INFO] Compiling 28 source files to <http://dhis.uio.no/ci/job/Dhis2%20Web%20Trunk/org.hisp.dhis$dhis-web-validationrule/ws/target/classes>
[HUDSON] Archiving <http://dhis.uio.no/ci/job/Dhis2%20Web%20Trunk/org.hisp.dhis$dhis-web-validationrule/ws/pom.xml> to /ifi/utgard/p01/dhis/projects/dhis-dev.ifi.uio.no/ci/home/jobs/Dhis2 Web Trunk/modules/org.hisp.dhis$dhis-web-validationrule/builds/2010-04-07_17-54-32/archive/org.hisp.dhis/dhis-web-validationrule/2.0.4-SNAPSHOT/pom.xml
[INFO] ------------------------------------------------------------------------
[ERROR] BUILD FAILURE
[INFO] ------------------------------------------------------------------------
[INFO] Compilation failure
<http://dhis.uio.no/ci/job/Dhis2%20Web%20Trunk/org.hisp.dhis$dhis-web-validationrule/ws/src/main/java/org/hisp/dhis/validationrule/action/dataanalysis/GetAnalysisAction.java>:[223,40] incompatible types
found : java.util.Collection<capture#708 of ?>
required: java.util.Collection<org.hisp.dhis.datavalue.DeflatedDataValue>

[INFO] ------------------------------------------------------------------------
[INFO] For more information, run Maven with the -e switch
[INFO] ------------------------------------------------------------------------
[INFO] Total time: 7 minutes 5 seconds
[INFO] Finished at: Wed Apr 07 18:01:43 CEST 2010

See <http://dhis.uio.no/ci/job/Dhis2%20Web%20Trunk/org.hisp.dhis$dhis-web-validationrule/535/>

···

------------------------------------------
[INFO] ------------------------------------------------------------------------
[INFO] Building DHIS Validation Rule
[INFO] task-segment: [clean, install, findbugs:findbugs]
[INFO] ------------------------------------------------------------------------
[INFO] [clean:clean {execution: default-clean}]
[INFO] Deleting directory <http://dhis.uio.no/ci/job/Dhis2%20Web%20Trunk/org.hisp.dhis$dhis-web-validationrule/ws/target>
[INFO] [resources:resources {execution: default-resources}]
[INFO] Using encoding: 'UTF-8' to copy filtered resources.
[INFO] [compiler:compile {execution: default-compile}]
[INFO] Compiling 28 source files to <http://dhis.uio.no/ci/job/Dhis2%20Web%20Trunk/org.hisp.dhis$dhis-web-validationrule/ws/target/classes>
[HUDSON] Archiving <http://dhis.uio.no/ci/job/Dhis2%20Web%20Trunk/org.hisp.dhis$dhis-web-validationrule/ws/pom.xml> to /ifi/utgard/p01/dhis/projects/dhis-dev.ifi.uio.no/ci/home/jobs/Dhis2 Web Trunk/modules/org.hisp.dhis$dhis-web-validationrule/builds/2010-04-07_18-24-25/archive/org.hisp.dhis/dhis-web-validationrule/2.0.4-SNAPSHOT/pom.xml
[INFO] ------------------------------------------------------------------------
[ERROR] BUILD FAILURE
[INFO] ------------------------------------------------------------------------
[INFO] Compilation failure
<http://dhis.uio.no/ci/job/Dhis2%20Web%20Trunk/org.hisp.dhis$dhis-web-validationrule/ws/src/main/java/org/hisp/dhis/validationrule/action/dataanalysis/GetAnalysisAction.java>:[223,40] incompatible types
found : java.util.Collection<capture#713 of ?>
required: java.util.Collection<org.hisp.dhis.datavalue.DeflatedDataValue>

[INFO] ------------------------------------------------------------------------
[INFO] For more information, run Maven with the -e switch
[INFO] ------------------------------------------------------------------------
[INFO] Total time: 6 minutes 33 seconds
[INFO] Finished at: Wed Apr 07 18:31:04 CEST 2010

See <http://dhis.uio.no/ci/job/Dhis2%20Web%20Trunk/org.hisp.dhis$dhis-web-validationrule/536/changes>