Build failed in Hudson: Dhis2 Service Trunk #1904

See <http://dhis.uio.no/ci/job/Dhis2%20Service%20Trunk/1904/changes>

Changes:

[Neeraj] Minor fix in Target Services

[Neeraj] Minor fix in Target API

···

------------------------------------------
[...truncated 834 lines...]
[INFO] Installing <http://dhis.uio.no/ci/job/Dhis2%20Service%20Trunk/ws/dhis-2/dhis-services/dhis-service-options/target/dhis-service-options-2.0.6-SNAPSHOT.jar> to /ifi/utgard/p01/dhis/.m2/repository/org/hisp/dhis/dhis-service-options/2.0.6-SNAPSHOT/dhis-service-options-2.0.6-SNAPSHOT.jar
[INFO] Preparing findbugs:findbugs
[HUDSON] Archiving <http://dhis.uio.no/ci/job/Dhis2%20Service%20Trunk/ws/dhis-2/dhis-services/dhis-service-options/pom.xml> to /ifi/utgard/p01/dhis/projects/dhis-dev.ifi.uio.no/ci/home/jobs/Dhis2 Service Trunk/modules/org.hisp.dhis$dhis-service-options/builds/2011-01-15_13-31-59/archive/org.hisp.dhis/dhis-service-options/2.0.6-SNAPSHOT/pom.xml
[HUDSON] Archiving <http://dhis.uio.no/ci/job/Dhis2%20Service%20Trunk/ws/dhis-2/dhis-services/dhis-service-options/target/dhis-service-options-2.0.6-SNAPSHOT.jar> to /ifi/utgard/p01/dhis/projects/dhis-dev.ifi.uio.no/ci/home/jobs/Dhis2 Service Trunk/modules/org.hisp.dhis$dhis-service-options/builds/2011-01-15_13-31-59/archive/org.hisp.dhis/dhis-service-options/2.0.6-SNAPSHOT/dhis-service-options-2.0.6-SNAPSHOT.jar
[INFO] [resources:resources {execution: default-resources}]
[INFO] Using encoding: 'UTF-8' to copy filtered resources.
[INFO] [compiler:compile {execution: default-compile}]
[INFO] Nothing to compile - all classes are up to date
[INFO] [findbugs:findbugs {execution: default-cli}]
[INFO] Using source root:
[INFO] <http://dhis.uio.no/ci/job/Dhis2%20Service%20Trunk/ws/dhis-2/dhis-services/dhis-service-options/target/classes>
[INFO] Using test source root:
[INFO] <http://dhis.uio.no/ci/job/Dhis2%20Service%20Trunk/ws/dhis-2/dhis-services/dhis-service-options/target/test-classes>
[INFO] No effort provided, using default effort.
[INFO] Adding Source Directory: <http://dhis.uio.no/ci/job/Dhis2%20Service%20Trunk/ws/dhis-2/dhis-services/dhis-service-options/src/main/java>
[INFO] No threshold provided, using default threshold.
[INFO] Using FindBugs Version: 1.3.8
[INFO] No threshold provided, using default threshold.
[INFO] No threshold provided, using default threshold.
[INFO] No threshold provided, using default threshold.
[INFO] Using the xdoc format
[INFO] No effort provided, using default effort.
[INFO] No threshold provided, using default threshold.
[INFO] No threshold provided, using default threshold.
[INFO] Debugging is Off
[INFO] No bug include filter.
[INFO] Using bug exclude filter /tmp/plexus-resources37142328tmp
[INFO] Printing Errors
[INFO] Printing Missing classes
[INFO] Printing Source Roots
[FINDBUGS] Successfully parsed file <http://dhis.uio.no/ci/job/Dhis2%20Service%20Trunk/ws/dhis-2/dhis-services/dhis-service-options/target/findbugsXml.xml> of module DHIS Options with 0 warnings.
[INFO] ------------------------------------------------------------------------
[INFO] Building DHIS Administration Service
[INFO] task-segment: [clean, install, findbugs:findbugs]
[INFO] ------------------------------------------------------------------------
[INFO] [clean:clean {execution: default-clean}]
[INFO] Deleting directory <http://dhis.uio.no/ci/job/Dhis2%20Service%20Trunk/ws/dhis-2/dhis-services/dhis-service-administration/target>
[INFO] [resources:resources {execution: default-resources}]
[INFO] Using encoding: 'UTF-8' to copy filtered resources.
[INFO] [compiler:compile {execution: default-compile}]
[INFO] Compiling 28 source files to <http://dhis.uio.no/ci/job/Dhis2%20Service%20Trunk/ws/dhis-2/dhis-services/dhis-service-administration/target/classes>
[INFO] [resources:testResources {execution: default-testResources}]
[INFO] Using encoding: 'UTF-8' to copy filtered resources.
[INFO] [compiler:testCompile {execution: default-testCompile}]
[INFO] Compiling 14 source files to <http://dhis.uio.no/ci/job/Dhis2%20Service%20Trunk/ws/dhis-2/dhis-services/dhis-service-administration/target/test-classes>
[INFO] [surefire:test {execution: default-test}]
[INFO] Surefire report directory: <http://dhis.uio.no/ci/job/Dhis2%20Service%20Trunk/ws/dhis-2/dhis-services/dhis-service-administration/target/surefire-reports>

-------------------------------------------------------
T E S T S
-------------------------------------------------------
Running org.hisp.dhis.sqlview.SqlViewServiceTest
Tests run: 8, Failures: 0, Errors: 0, Skipped: 0, Time elapsed: 49.978 sec
Running org.hisp.dhis.dataarchive.DataArchiveServiceTest
Tests run: 2, Failures: 0, Errors: 0, Skipped: 1, Time elapsed: 1.829 sec
Running org.hisp.dhis.dataintegrity.DataIntegrityServiceTest
Tests run: 12, Failures: 0, Errors: 0, Skipped: 0, Time elapsed: 8.512 sec
Running org.hisp.dhis.maintenance.MaintenanceStoreTest
Tests run: 1, Failures: 0, Errors: 0, Skipped: 0, Time elapsed: 0.111 sec
Running org.hisp.dhis.datalock.DataSetLockServiceTest
Tests run: 10, Failures: 0, Errors: 0, Skipped: 0, Time elapsed: 2.341 sec
Running org.hisp.dhis.statistics.StatisticsProviderTest
Tests run: 2, Failures: 0, Errors: 0, Skipped: 0, Time elapsed: 0.234 sec
Running org.hisp.dhis.databrowser.DataBrowserServiceTest
Tests run: 10, Failures: 0, Errors: 0, Skipped: 2, Time elapsed: 4.868 sec
Running org.hisp.dhis.useraudit.UserAuditStoreTest
Tests run: 2, Failures: 0, Errors: 0, Skipped: 0, Time elapsed: 0.193 sec
Running org.hisp.dhis.databrowser.DataBrowserStoreTest
Tests run: 1, Failures: 0, Errors: 0, Skipped: 0, Time elapsed: 0.433 sec
Running org.hisp.dhis.resourcetable.ResourceTableServiceTest
Tests run: 1, Failures: 0, Errors: 0, Skipped: 0, Time elapsed: 0.093 sec

Results :

Tests run: 49, Failures: 0, Errors: 0, Skipped: 3

[HUDSON] Recording test results
[INFO] [jar:jar {execution: default-jar}]
[INFO] Building jar: <http://dhis.uio.no/ci/job/Dhis2%20Service%20Trunk/ws/dhis-2/dhis-services/dhis-service-administration/target/dhis-service-administration-2.0.6-SNAPSHOT.jar>
[INFO] [install:install {execution: default-install}]
[INFO] Installing <http://dhis.uio.no/ci/job/Dhis2%20Service%20Trunk/ws/dhis-2/dhis-services/dhis-service-administration/target/dhis-service-administration-2.0.6-SNAPSHOT.jar> to /ifi/utgard/p01/dhis/.m2/repository/org/hisp/dhis/dhis-service-administration/2.0.6-SNAPSHOT/dhis-service-administration-2.0.6-SNAPSHOT.jar
[INFO] Preparing findbugs:findbugs
[HUDSON] Archiving <http://dhis.uio.no/ci/job/Dhis2%20Service%20Trunk/ws/dhis-2/dhis-services/dhis-service-administration/pom.xml> to /ifi/utgard/p01/dhis/projects/dhis-dev.ifi.uio.no/ci/home/jobs/Dhis2 Service Trunk/modules/org.hisp.dhis$dhis-service-administration/builds/2011-01-15_13-31-59/archive/org.hisp.dhis/dhis-service-administration/2.0.6-SNAPSHOT/pom.xml
[HUDSON] Archiving <http://dhis.uio.no/ci/job/Dhis2%20Service%20Trunk/ws/dhis-2/dhis-services/dhis-service-administration/target/dhis-service-administration-2.0.6-SNAPSHOT.jar> to /ifi/utgard/p01/dhis/projects/dhis-dev.ifi.uio.no/ci/home/jobs/Dhis2 Service Trunk/modules/org.hisp.dhis$dhis-service-administration/builds/2011-01-15_13-31-59/archive/org.hisp.dhis/dhis-service-administration/2.0.6-SNAPSHOT/dhis-service-administration-2.0.6-SNAPSHOT.jar
[INFO] [resources:resources {execution: default-resources}]
[INFO] Using encoding: 'UTF-8' to copy filtered resources.
[INFO] [compiler:compile {execution: default-compile}]
[INFO] Nothing to compile - all classes are up to date
[INFO] [findbugs:findbugs {execution: default-cli}]
[INFO] Using source root:
[INFO] <http://dhis.uio.no/ci/job/Dhis2%20Service%20Trunk/ws/dhis-2/dhis-services/dhis-service-administration/target/classes>
[INFO] Using test source root:
[INFO] <http://dhis.uio.no/ci/job/Dhis2%20Service%20Trunk/ws/dhis-2/dhis-services/dhis-service-administration/target/test-classes>
[INFO] No effort provided, using default effort.
[INFO] Adding Source Directory: <http://dhis.uio.no/ci/job/Dhis2%20Service%20Trunk/ws/dhis-2/dhis-services/dhis-service-administration/src/main/java>
[INFO] No threshold provided, using default threshold.
[INFO] Using FindBugs Version: 1.3.8
[INFO] No threshold provided, using default threshold.
[INFO] No threshold provided, using default threshold.
[INFO] No threshold provided, using default threshold.
[INFO] Using the xdoc format
[INFO] No effort provided, using default effort.
[INFO] No threshold provided, using default threshold.
[INFO] No threshold provided, using default threshold.
[INFO] Debugging is Off
[INFO] No bug include filter.
[INFO] Using bug exclude filter /tmp/plexus-resources909612215tmp
[FINDBUGS] Successfully parsed file <http://dhis.uio.no/ci/job/Dhis2%20Service%20Trunk/ws/dhis-2/dhis-services/dhis-service-administration/target/findbugsXml.xml> of module DHIS Administration Service with 40 warnings.
[INFO] Printing Errors
[INFO] Printing Missing classes
[INFO] Printing Source Roots
[INFO] ------------------------------------------------------------------------
[INFO] Building DHIS DataMart Service - Default
[INFO] task-segment: [clean, install, findbugs:findbugs]
[INFO] ------------------------------------------------------------------------
[INFO] [clean:clean {execution: default-clean}]
[INFO] Deleting directory <http://dhis.uio.no/ci/job/Dhis2%20Service%20Trunk/ws/dhis-2/dhis-services/dhis-service-datamart-default/target>
[INFO] [resources:resources {execution: default-resources}]
[INFO] Using encoding: 'UTF-8' to copy filtered resources.
[INFO] [compiler:compile {execution: default-compile}]
[INFO] Compiling 27 source files to <http://dhis.uio.no/ci/job/Dhis2%20Service%20Trunk/ws/dhis-2/dhis-services/dhis-service-datamart-default/target/classes>
[INFO] [resources:testResources {execution: default-testResources}]
[INFO] Using encoding: 'UTF-8' to copy filtered resources.
[INFO] [compiler:testCompile {execution: default-testCompile}]
[INFO] Compiling 8 source files to <http://dhis.uio.no/ci/job/Dhis2%20Service%20Trunk/ws/dhis-2/dhis-services/dhis-service-datamart-default/target/test-classes>
[INFO] [surefire:test {execution: default-test}]
[INFO] Surefire report directory: <http://dhis.uio.no/ci/job/Dhis2%20Service%20Trunk/ws/dhis-2/dhis-services/dhis-service-datamart-default/target/surefire-reports>

-------------------------------------------------------
T E S T S
-------------------------------------------------------
Running org.hisp.dhis.datamart.crosstab.CrossTabStoreTest
Tests run: 1, Failures: 0, Errors: 0, Skipped: 0, Time elapsed: 46.465 sec
Running org.hisp.dhis.datamart.DataMartServiceAggregationLevelsTest
Tests run: 2, Failures: 0, Errors: 0, Skipped: 0, Time elapsed: 12.47 sec
Running org.hisp.dhis.datamart.DataMartServiceTest
Tests run: 7, Failures: 0, Errors: 0, Skipped: 0, Time elapsed: 25.812 sec
Running org.hisp.dhis.datamart.DataMartExportServiceTest
Tests run: 4, Failures: 0, Errors: 0, Skipped: 0, Time elapsed: 2.185 sec
Running org.hisp.dhis.datamart.DataMartExportStoreTest
Tests run: 4, Failures: 0, Errors: 0, Skipped: 0, Time elapsed: 2.262 sec
Running org.hisp.dhis.datamart.DataMartServiceTimeDimensionTest
Tests run: 2, Failures: 0, Errors: 0, Skipped: 0, Time elapsed: 0.483 sec
Running org.hisp.dhis.datamart.crosstab.CrossTabServiceTest
Tests run: 1, Failures: 0, Errors: 0, Skipped: 0, Time elapsed: 4.406 sec
Running org.hisp.dhis.datamart.DataMartServiceMultiDimensionTest
Tests run: 7, Failures: 0, Errors: 0, Skipped: 7, Time elapsed: 0.023 sec

Results :

Tests run: 28, Failures: 0, Errors: 0, Skipped: 7

[HUDSON] Recording test results
FATAL: Failed to save the JUnit test result
java.io.IOException: Disk quota exceeded
  at java.io.FileOutputStream.close0(Native Method)
  at java.io.FileOutputStream.close(FileOutputStream.java:279)
  at sun.nio.cs.StreamEncoder.implClose(StreamEncoder.java:301)
  at sun.nio.cs.StreamEncoder.close(StreamEncoder.java:130)
  at java.io.OutputStreamWriter.close(OutputStreamWriter.java:216)
  at java.io.BufferedWriter.close(BufferedWriter.java:248)
  at hudson.util.AtomicFileWriter.close(AtomicFileWriter.java:94)
  at hudson.util.AtomicFileWriter.commit(AtomicFileWriter.java:109)
  at hudson.XmlFile.write(XmlFile.java:166)
  at hudson.tasks.junit.TestResultAction.setResult(TestResultAction.java:82)
  at hudson.tasks.junit.TestResultAction.<init>(TestResultAction.java:67)
  at hudson.maven.reporters.SurefireReport.<init>(SurefireReport.java:45)
  at hudson.maven.reporters.SurefireArchiver$1.call(SurefireArchiver.java:114)
  at hudson.maven.reporters.SurefireArchiver$1.call(SurefireArchiver.java:110)
  at hudson.maven.MavenBuild$ProxyImpl.execute(MavenBuild.java:341)
  at sun.reflect.GeneratedMethodAccessor118.invoke(Unknown Source)
  at sun.reflect.DelegatingMethodAccessorImpl.invoke(DelegatingMethodAccessorImpl.java:25)
  at java.lang.reflect.Method.invoke(Method.java:597)
  at hudson.model.Executor$1.call(Executor.java:405)
  at hudson.util.InterceptingProxy$1.invoke(InterceptingProxy.java:23)
  at $Proxy18.execute(Unknown Source)
  at sun.reflect.GeneratedMethodAccessor123.invoke(Unknown Source)
  at sun.reflect.DelegatingMethodAccessorImpl.invoke(DelegatingMethodAccessorImpl.java:25)
  at java.lang.reflect.Method.invoke(Method.java:597)
  at hudson.remoting.RemoteInvocationHandler$RPCRequest.perform(RemoteInvocationHandler.java:274)
  at hudson.remoting.RemoteInvocationHandler$RPCRequest.call(RemoteInvocationHandler.java:255)
  at hudson.remoting.RemoteInvocationHandler$RPCRequest.call(RemoteInvocationHandler.java:215)
  at hudson.remoting.UserRequest.perform(UserRequest.java:114)
  at hudson.remoting.UserRequest.perform(UserRequest.java:48)
  at hudson.remoting.Request$2.run(Request.java:270)
  at java.util.concurrent.Executors$RunnableAdapter.call(Executors.java:441)
  at java.util.concurrent.FutureTask$Sync.innerRun(FutureTask.java:303)
  at java.util.concurrent.FutureTask.run(FutureTask.java:138)
  at java.util.concurrent.ThreadPoolExecutor$Worker.runTask(ThreadPoolExecutor.java:886)
  at java.util.concurrent.ThreadPoolExecutor$Worker.run(ThreadPoolExecutor.java:908)
  at java.lang.Thread.run(Thread.java:662)
[INFO] [jar:jar {execution: default-jar}]
[HUDSON] Archiving <http://dhis.uio.no/ci/job/Dhis2%20Service%20Trunk/ws/dhis-2/dhis-services/dhis-service-datamart-default/pom.xml> to /ifi/utgard/p01/dhis/projects/dhis-dev.ifi.uio.no/ci/home/jobs/Dhis2 Service Trunk/modules/org.hisp.dhis$dhis-service-datamart-default/builds/2011-01-15_13-31-59/archive/org.hisp.dhis/dhis-service-datamart-default/2.0.6-SNAPSHOT/pom.xml
[INFO] ------------------------------------------------------------------------
[ERROR] BUILD ERROR
[INFO] ------------------------------------------------------------------------
[INFO] Error assembling JAR

Embedded error: Disk quota exceeded
[INFO] ------------------------------------------------------------------------
[INFO] For more information, run Maven with the -e switch
[INFO] ------------------------------------------------------------------------
[INFO] Total time: 14 minutes 16 seconds
[INFO] Finished at: Sat Jan 15 13:46:28 CET 2011
[INFO] Final Memory: 148M/353M
[INFO] ------------------------------------------------------------------------
ERROR: Asynchronous execution failure
java.util.concurrent.ExecutionException: java.io.IOException: Disk quota exceeded
  at hudson.remoting.Channel$2.adapt(Channel.java:662)
  at hudson.remoting.Channel$2.adapt(Channel.java:657)
  at hudson.remoting.FutureAdapter.get(FutureAdapter.java:55)
  at hudson.maven.MavenBuilder.call(MavenBuilder.java:176)
  at hudson.maven.MavenModuleSetBuild$Builder.call(MavenModuleSetBuild.java:744)
  at hudson.maven.MavenModuleSetBuild$Builder.call(MavenModuleSetBuild.java:688)
  at hudson.remoting.UserRequest.perform(UserRequest.java:114)
  at hudson.remoting.UserRequest.perform(UserRequest.java:48)
  at hudson.remoting.Request$2.run(Request.java:270)
  at java.util.concurrent.Executors$RunnableAdapter.call(Executors.java:441)
  at java.util.concurrent.FutureTask$Sync.innerRun(FutureTask.java:303)
  at java.util.concurrent.FutureTask.run(FutureTask.java:138)
  at java.util.concurrent.ThreadPoolExecutor$Worker.runTask(ThreadPoolExecutor.java:886)
  at java.util.concurrent.ThreadPoolExecutor$Worker.run(ThreadPoolExecutor.java:908)
  at java.lang.Thread.run(Thread.java:662)
Caused by: java.io.IOException: Disk quota exceeded
  at java.io.FileOutputStream.close0(Native Method)
  at java.io.FileOutputStream.close(FileOutputStream.java:279)
  at sun.nio.cs.StreamEncoder.implClose(StreamEncoder.java:301)
  at sun.nio.cs.StreamEncoder.close(StreamEncoder.java:130)
  at java.io.OutputStreamWriter.close(OutputStreamWriter.java:216)
  at java.io.BufferedWriter.close(BufferedWriter.java:248)
  at hudson.util.AtomicFileWriter.close(AtomicFileWriter.java:94)
  at hudson.util.AtomicFileWriter.commit(AtomicFileWriter.java:109)
  at hudson.XmlFile.write(XmlFile.java:166)
  at hudson.model.Fingerprint.save(Fingerprint.java:704)
  at hudson.model.Fingerprint.add(Fingerprint.java:666)
  at hudson.model.Fingerprint.add(Fingerprint.java:651)
  at hudson.maven.reporters.MavenFingerprinter$1.call(MavenFingerprinter.java:105)
  at hudson.maven.reporters.MavenFingerprinter$1.call(MavenFingerprinter.java:96)
  at hudson.maven.MavenBuild$ProxyImpl.execute(MavenBuild.java:341)
  at sun.reflect.GeneratedMethodAccessor118.invoke(Unknown Source)
  at sun.reflect.DelegatingMethodAccessorImpl.invoke(DelegatingMethodAccessorImpl.java:25)
  at java.lang.reflect.Method.invoke(Method.java:597)
  at hudson.model.Executor$1.call(Executor.java:405)
  at hudson.util.InterceptingProxy$1.invoke(InterceptingProxy.java:23)
  at $Proxy18.execute(Unknown Source)
  at hudson.maven.MavenBuildProxy$Filter$AsyncInvoker.call(MavenBuildProxy.java:261)
  ... 9 more
Sending e-mails to: dhis2-devs@lists.launchpad.net
channel stopped

See <http://dhis.uio.no/ci/job/Dhis2%20Service%20Trunk/1905/changes>