Build failed in Hudson: Dhis2 Service Trunk #1312

See <http://dhis.uio.no/ci/job/Dhis2%20Service%20Trunk/1312/changes>

Changes:

[Jan Henrik Overland] (GIS) Base coordinate removed from client and server as it is no longer needed.

···

------------------------------------------
Started by an SCM change
$ bzr revision-info -d "<http://dhis.uio.no/ci/job/Dhis2%20Service%20Trunk/ws/">
[workspace] $ bzr pull --overwrite https://code.launchpad.net/~dhis2-devs-core/dhis2/trunk
M dhis-2/dhis-api/src/main/java/org/hisp/dhis/mapping/Map.java
M dhis-2/dhis-api/src/main/java/org/hisp/dhis/mapping/MappingService.java
M dhis-2/dhis-services/dhis-service-mapping/src/main/java/org/hisp/dhis/mapping/DefaultMappingService.java
M dhis-2/dhis-services/dhis-service-mapping/src/main/resources/org/hisp/dhis/mapping/hibernate/Map.hbm.xml
M dhis-2/dhis-web/dhis-web-mapping/src/main/java/org/hisp/dhis/mapping/action/AddOrUpdateMapAction.java
M dhis-2/dhis-web/dhis-web-mapping/src/main/webapp/dhis-web-mapping/mapping/script/index.js
M dhis-2/dhis-web/dhis-web-mapping/src/main/webapp/dhis-web-mapping/resources/mapfish/widgets/geostat/Choropleth.js
M dhis-2/dhis-web/dhis-web-mapping/src/main/webapp/dhis-web-mapping/resources/mapfish/widgets/geostat/Symbol.js
All changes applied successfully.
Now on revision 2352.
$ bzr revision-info -d "<http://dhis.uio.no/ci/job/Dhis2%20Service%20Trunk/ws/">
[workspace] $ bzr log -v -r revid:janhenrik.overland@gmail.com-20101012112514-vzg38nc22nn621nk..revid:janhenrik.overland@gmail.com-20101012132615-ann6nz0rxbg0tcxk --long --show-ids
Getting local revision...
$ bzr revision-info -d "<http://dhis.uio.no/ci/job/Dhis2%20Service%20Trunk/ws/">
janhenrik.overland@gmail.com-20101012132615-ann6nz0rxbg0tcxk
Parsing POMs
[dhis-2] $ /local/opt/j2sdk/bin/java -Xmx2048m -XX:MaxPermSize=512m -cp /ifi/utgard/p01/dhis/projects/dhis-dev.ifi.uio.no/ci/home/plugins/maven-plugin/WEB-INF/lib/maven-agent-1.375.jar:/ifi/utgard/p01/dhis/projects/dhis-dev.ifi.uio.no/ci/home/tools/2.2.1/boot/classworlds-1.1.jar hudson.maven.agent.Main /ifi/utgard/p01/dhis/projects/dhis-dev.ifi.uio.no/ci/home/tools/2.2.1 /ifi/utgard/p01/dhis/projects/dhis-dev.ifi.uio.no/ci/tomcat/webapps/ci/WEB-INF/lib/remoting-1.375.jar /ifi/utgard/p01/dhis/projects/dhis-dev.ifi.uio.no/ci/home/plugins/maven-plugin/WEB-INF/lib/maven-interceptor-1.375.jar 35040 /ifi/utgard/p01/dhis/projects/dhis-dev.ifi.uio.no/ci/home/plugins/maven-plugin/WEB-INF/lib/maven2.1-interceptor-1.2.jar
<===[HUDSON REMOTING CAPACITY]===> channel started
Executing Maven: -B -f <http://dhis.uio.no/ci/job/Dhis2%20Service%20Trunk/ws/dhis-2/pom.xml> clean install findbugs:findbugs
[INFO] Scanning for projects...
[INFO] Reactor build order:
[INFO] DHIS 2
[INFO] DHIS API
[INFO] DHIS Support Parent Project
[INFO] DHIS Test Support
[INFO] DHIS External Support
[INFO] DHIS Hibernate Support
[INFO] DHIS System Support
[INFO] DHIS JDBC Service
[INFO] DHIS Services Parent Project
[INFO] DHIS Core API Implementations
[INFO] DHIS XML framework services
[INFO] DHIS I18n Static
[INFO] DHIS Options
[INFO] DHIS Administration Service
[INFO] DHIS DataMart Service - Default
[INFO] DHIS Aggregation Service - Default
[INFO] DHIS OrganisationUnit API Implementations
[INFO] DHIS Reporting Service
[INFO] DHIS Import-Export Service
[INFO] DHIS Excel Reporting Service
[INFO] DHIS Patient API Implementations
[INFO] DHIS JDBC / External Test Project
[INFO] ------------------------------------------------------------------------
[INFO] Building DHIS 2
[INFO] task-segment: [clean, install, findbugs:findbugs]
[INFO] ------------------------------------------------------------------------
[INFO] [clean:clean {execution: default-clean}]
[INFO] [site:attach-descriptor {execution: default-attach-descriptor}]
[INFO] [install:install {execution: default-install}]
[INFO] Installing <http://dhis.uio.no/ci/job/Dhis2%20Service%20Trunk/ws/dhis-2/pom.xml> to /ifi/utgard/p01/dhis/.m2/repository/org/hisp/dhis/dhis/2.0.6-SNAPSHOT/dhis-2.0.6-SNAPSHOT.pom
[INFO] Preparing findbugs:findbugs
[INFO] No goals needed for project - skipping
[INFO] Setting property: classpath.resource.loader.class => 'org.codehaus.plexus.velocity.ContextClassLoaderResourceLoader'.
[INFO] Setting property: velocimacro.messages.on => 'false'.
[INFO] Setting property: resource.loader => 'classpath'.
[INFO] Setting property: resource.manager.logwhenfound => 'false'.
[INFO] **************************************************************
[INFO] Starting Jakarta Velocity v1.4
[INFO] RuntimeInstance initializing.
[INFO] Default Properties File: org/apache/velocity/runtime/defaults/velocity.properties
[INFO] Default ResourceManager initializing. (class org.apache.velocity.runtime.resource.ResourceManagerImpl)
[INFO] Resource Loader Instantiated: org.codehaus.plexus.velocity.ContextClassLoaderResourceLoader
[INFO] ClasspathResourceLoader : initialization starting.
[INFO] ClasspathResourceLoader : initialization complete.
[INFO] ResourceCache : initialized. (class org.apache.velocity.runtime.resource.ResourceCacheImpl)
[INFO] Default ResourceManager initialization complete.
[INFO] Loaded System Directive: org.apache.velocity.runtime.directive.Literal
[INFO] Loaded System Directive: org.apache.velocity.runtime.directive.Macro
[INFO] Loaded System Directive: org.apache.velocity.runtime.directive.Parse
[INFO] Loaded System Directive: org.apache.velocity.runtime.directive.Include
[INFO] Loaded System Directive: org.apache.velocity.runtime.directive.Foreach
[INFO] Created: 20 parsers.
[INFO] Velocimacro : initialization starting.
[INFO] Velocimacro : adding VMs from VM library template : VM_global_library.vm
[ERROR] ResourceManager : unable to find resource 'VM_global_library.vm' in any resource loader.
[INFO] Velocimacro : error using VM library template VM_global_library.vm : org.apache.velocity.exception.ResourceNotFoundException: Unable to find resource 'VM_global_library.vm'
[INFO] Velocimacro : VM library template macro registration complete.
[INFO] Velocimacro : allowInline = true : VMs can be defined inline in templates
[INFO] Velocimacro : allowInlineToOverride = false : VMs defined inline may NOT replace previous VM definitions
[INFO] Velocimacro : allowInlineLocal = false : VMs defined inline will be global in scope if allowed.
[INFO] Velocimacro : initialization complete.
[INFO] Velocity successfully started.
[INFO] [findbugs:findbugs {execution: default-cli}]
[INFO] Using source root:
[INFO] <http://dhis.uio.no/ci/job/Dhis2%20Service%20Trunk/ws/dhis-2/target/classes>
[INFO] Using test source root:
[INFO] <http://dhis.uio.no/ci/job/Dhis2%20Service%20Trunk/ws/dhis-2/target/test-classes>
[INFO] Output class directory doesn't exist. Skipping findbugs.
[HUDSON] Archiving <http://dhis.uio.no/ci/job/Dhis2%20Service%20Trunk/ws/dhis-2/pom.xml> to /ifi/utgard/p01/dhis/projects/dhis-dev.ifi.uio.no/ci/home/jobs/Dhis2 Service Trunk/modules/org.hisp.dhis$dhis/builds/2010-10-12_15-31-29/archive/org.hisp.dhis/dhis/2.0.6-SNAPSHOT/pom.xml
[HUDSON] Archiving /ifi/utgard/p01/dhis/.m2/repository/org/hisp/dhis/dhis/2.0.6-SNAPSHOT/dhis-2.0.6-SNAPSHOT.pom to /ifi/utgard/p01/dhis/projects/dhis-dev.ifi.uio.no/ci/home/jobs/Dhis2 Service Trunk/modules/org.hisp.dhis$dhis/builds/2010-10-12_15-31-29/archive/org.hisp.dhis/dhis/2.0.6-SNAPSHOT/dhis-2.0.6-SNAPSHOT.pom
[INFO] ------------------------------------------------------------------------
[INFO] Building DHIS API
[INFO] task-segment: [clean, install, findbugs:findbugs]
[INFO] ------------------------------------------------------------------------
[INFO] [clean:clean {execution: default-clean}]
[INFO] Deleting directory <http://dhis.uio.no/ci/job/Dhis2%20Service%20Trunk/ws/dhis-2/dhis-api/target>
[INFO] [resources:resources {execution: default-resources}]
[INFO] Using encoding: 'UTF-8' to copy filtered resources.
[INFO] [compiler:compile {execution: default-compile}]
[INFO] Compiling 346 source files to <http://dhis.uio.no/ci/job/Dhis2%20Service%20Trunk/ws/dhis-2/dhis-api/target/classes>
[INFO] [resources:testResources {execution: default-testResources}]
[INFO] Using encoding: 'UTF-8' to copy filtered resources.
[INFO] [compiler:testCompile {execution: default-testCompile}]
[INFO] Compiling 8 source files to <http://dhis.uio.no/ci/job/Dhis2%20Service%20Trunk/ws/dhis-2/dhis-api/target/test-classes>
[INFO] [surefire:test {execution: default-test}]
[INFO] Surefire report directory: <http://dhis.uio.no/ci/job/Dhis2%20Service%20Trunk/ws/dhis-2/dhis-api/target/surefire-reports>

-------------------------------------------------------
T E S T S
-------------------------------------------------------
Running org.hisp.dhis.dataelement.DimensionTest
Tests run: 1, Failures: 0, Errors: 0, Skipped: 0, Time elapsed: 0.167 sec
Running org.hisp.dhis.period.RelativePeriodTest
Tests run: 3, Failures: 0, Errors: 0, Skipped: 0, Time elapsed: 0.097 sec
Running org.hisp.dhis.dataentryform.DataEntryFormTest
Tests run: 2, Failures: 0, Errors: 0, Skipped: 0, Time elapsed: 0.032 sec
Running org.hisp.dhis.period.WeeklyPeriodTypeTest
Tests run: 2, Failures: 0, Errors: 0, Skipped: 1, Time elapsed: 0.011 sec
Running org.hisp.dhis.dataelement.OperandTest
Tests run: 2, Failures: 0, Errors: 0, Skipped: 0, Time elapsed: 0.023 sec
Running org.hisp.dhis.organisationunit.OrganisationUnitTest
Tests run: 2, Failures: 0, Errors: 0, Skipped: 0, Time elapsed: 0.022 sec
Running org.hisp.dhis.dataelement.DataElementTest
Tests run: 2, Failures: 0, Errors: 0, Skipped: 0, Time elapsed: 0.014 sec
Running org.hisp.dhis.organisationunit.OrganisationUnitHierarchyTest
Tests run: 1, Failures: 0, Errors: 0, Skipped: 0, Time elapsed: 0.011 sec

Results :

Tests run: 15, Failures: 0, Errors: 0, Skipped: 1

[HUDSON] Recording test results
[INFO] [jar:jar {execution: default-jar}]
[INFO] Building jar: <http://dhis.uio.no/ci/job/Dhis2%20Service%20Trunk/ws/dhis-2/dhis-api/target/dhis-api-2.0.6-SNAPSHOT.jar>
[INFO] [install:install {execution: default-install}]
[INFO] Installing <http://dhis.uio.no/ci/job/Dhis2%20Service%20Trunk/ws/dhis-2/dhis-api/target/dhis-api-2.0.6-SNAPSHOT.jar> to /ifi/utgard/p01/dhis/.m2/repository/org/hisp/dhis/dhis-api/2.0.6-SNAPSHOT/dhis-api-2.0.6-SNAPSHOT.jar
[INFO] Preparing findbugs:findbugs
[HUDSON] Archiving <http://dhis.uio.no/ci/job/Dhis2%20Service%20Trunk/ws/dhis-2/dhis-api/pom.xml> to /ifi/utgard/p01/dhis/projects/dhis-dev.ifi.uio.no/ci/home/jobs/Dhis2 Service Trunk/modules/org.hisp.dhis$dhis-api/builds/2010-10-12_15-31-29/archive/org.hisp.dhis/dhis-api/2.0.6-SNAPSHOT/pom.xml
[HUDSON] Archiving <http://dhis.uio.no/ci/job/Dhis2%20Service%20Trunk/ws/dhis-2/dhis-api/target/dhis-api-2.0.6-SNAPSHOT.jar> to /ifi/utgard/p01/dhis/projects/dhis-dev.ifi.uio.no/ci/home/jobs/Dhis2 Service Trunk/modules/org.hisp.dhis$dhis-api/builds/2010-10-12_15-31-29/archive/org.hisp.dhis/dhis-api/2.0.6-SNAPSHOT/dhis-api-2.0.6-SNAPSHOT.jar
[INFO] [resources:resources {execution: default-resources}]
[INFO] Using encoding: 'UTF-8' to copy filtered resources.
[INFO] [compiler:compile {execution: default-compile}]
[INFO] Nothing to compile - all classes are up to date
[INFO] [findbugs:findbugs {execution: default-cli}]
[INFO] Using source root:
[INFO] <http://dhis.uio.no/ci/job/Dhis2%20Service%20Trunk/ws/dhis-2/dhis-api/target/classes>
[INFO] Using test source root:
[INFO] <http://dhis.uio.no/ci/job/Dhis2%20Service%20Trunk/ws/dhis-2/dhis-api/target/test-classes>
[INFO] No effort provided, using default effort.
[INFO] Adding Source Directory: <http://dhis.uio.no/ci/job/Dhis2%20Service%20Trunk/ws/dhis-2/dhis-api/src/main/java>
[INFO] No threshold provided, using default threshold.
[INFO] Using FindBugs Version: 1.3.8
[INFO] No threshold provided, using default threshold.
[INFO] No threshold provided, using default threshold.
[INFO] No threshold provided, using default threshold.
[INFO] Using the xdoc format
[INFO] No effort provided, using default effort.
[INFO] No threshold provided, using default threshold.
[INFO] No threshold provided, using default threshold.
[INFO] Debugging is Off
[INFO] No bug include filter.
[INFO] Using bug exclude filter /tmp/plexus-resources1121666323tmp
[INFO] Printing Errors
[INFO] Printing Missing classes
[INFO] Printing Source Roots
log4j:WARN No appenders could be found for logger (org.apache.commons.digester.Digester.sax).
log4j:WARN Please initialize the log4j system properly.
[FINDBUGS] Successfully parsed file <http://dhis.uio.no/ci/job/Dhis2%20Service%20Trunk/ws/dhis-2/dhis-api/target/findbugsXml.xml> of module DHIS API with 115 warnings.
[INFO] ------------------------------------------------------------------------
[INFO] Building DHIS Support Parent Project
[INFO] task-segment: [clean, install, findbugs:findbugs]
[INFO] ------------------------------------------------------------------------
[INFO] [clean:clean {execution: default-clean}]
[INFO] [site:attach-descriptor {execution: default-attach-descriptor}]
[INFO] [install:install {execution: default-install}]
[INFO] Installing <http://dhis.uio.no/ci/job/Dhis2%20Service%20Trunk/ws/dhis-2/dhis-support/pom.xml> to /ifi/utgard/p01/dhis/.m2/repository/org/hisp/dhis/dhis-support/2.0.6-SNAPSHOT/dhis-support-2.0.6-SNAPSHOT.pom
[INFO] Preparing findbugs:findbugs
[INFO] No goals needed for project - skipping
[INFO] [findbugs:findbugs {execution: default-cli}]
[INFO] Using source root:
[INFO] <http://dhis.uio.no/ci/job/Dhis2%20Service%20Trunk/ws/dhis-2/dhis-support/target/classes>
[INFO] Using test source root:
[INFO] <http://dhis.uio.no/ci/job/Dhis2%20Service%20Trunk/ws/dhis-2/dhis-support/target/test-classes>
[INFO] Output class directory doesn't exist. Skipping findbugs.
[HUDSON] Archiving <http://dhis.uio.no/ci/job/Dhis2%20Service%20Trunk/ws/dhis-2/dhis-support/pom.xml> to /ifi/utgard/p01/dhis/projects/dhis-dev.ifi.uio.no/ci/home/jobs/Dhis2 Service Trunk/modules/org.hisp.dhis$dhis-support/builds/2010-10-12_15-31-29/archive/org.hisp.dhis/dhis-support/2.0.6-SNAPSHOT/pom.xml
[HUDSON] Archiving /ifi/utgard/p01/dhis/.m2/repository/org/hisp/dhis/dhis-support/2.0.6-SNAPSHOT/dhis-support-2.0.6-SNAPSHOT.pom to /ifi/utgard/p01/dhis/projects/dhis-dev.ifi.uio.no/ci/home/jobs/Dhis2 Service Trunk/modules/org.hisp.dhis$dhis-support/builds/2010-10-12_15-31-29/archive/org.hisp.dhis/dhis-support/2.0.6-SNAPSHOT/dhis-support-2.0.6-SNAPSHOT.pom
[INFO] ------------------------------------------------------------------------
[INFO] Building DHIS Test Support
[INFO] task-segment: [clean, install, findbugs:findbugs]
[INFO] ------------------------------------------------------------------------
[INFO] [clean:clean {execution: default-clean}]
[INFO] Deleting directory <http://dhis.uio.no/ci/job/Dhis2%20Service%20Trunk/ws/dhis-2/dhis-support/dhis-support-test/target>
[INFO] [resources:resources {execution: default-resources}]
[INFO] Using encoding: 'UTF-8' to copy filtered resources.
[INFO] [compiler:compile {execution: default-compile}]
[INFO] Compiling 6 source files to <http://dhis.uio.no/ci/job/Dhis2%20Service%20Trunk/ws/dhis-2/dhis-support/dhis-support-test/target/classes>
[HUDSON] Archiving <http://dhis.uio.no/ci/job/Dhis2%20Service%20Trunk/ws/dhis-2/dhis-support/dhis-support-test/pom.xml> to /ifi/utgard/p01/dhis/projects/dhis-dev.ifi.uio.no/ci/home/jobs/Dhis2 Service Trunk/modules/org.hisp.dhis$dhis-support-test/builds/2010-10-12_15-31-29/archive/org.hisp.dhis/dhis-support-test/2.0.6-SNAPSHOT/pom.xml
[INFO] ------------------------------------------------------------------------
[ERROR] BUILD FAILURE
[INFO] ------------------------------------------------------------------------
[INFO] Compilation failure

<http://dhis.uio.no/ci/job/Dhis2%20Service%20Trunk/ws/dhis-2/dhis-support/dhis-support-test/src/main/java/org/hisp/dhis/DhisConvenienceTest.java>:[800,11] cannot find symbol
symbol : method setLongitude(java.lang.String)
location: class org.hisp.dhis.mapping.Map

<http://dhis.uio.no/ci/job/Dhis2%20Service%20Trunk/ws/dhis-2/dhis-support/dhis-support-test/src/main/java/org/hisp/dhis/DhisConvenienceTest.java>:[801,11] cannot find symbol
symbol : method setLatitude(java.lang.String)
location: class org.hisp.dhis.mapping.Map

<http://dhis.uio.no/ci/job/Dhis2%20Service%20Trunk/ws/dhis-2/dhis-support/dhis-support-test/src/main/java/org/hisp/dhis/DhisConvenienceTest.java>:[802,11] cannot find symbol
symbol : method setZoom(int)
location: class org.hisp.dhis.mapping.Map

[INFO] ------------------------------------------------------------------------
[INFO] For more information, run Maven with the -e switch
[INFO] ------------------------------------------------------------------------
[INFO] Total time: 2 minutes 23 seconds
[INFO] Finished at: Tue Oct 12 15:34:01 CEST 2010
[INFO] Final Memory: 70M/251M
[INFO] ------------------------------------------------------------------------
Waiting for Hudson to finish collecting data
Sending e-mails to: dhis2-devs@lists.launchpad.net
channel stopped

See <http://dhis.uio.no/ci/job/Dhis2%20Service%20Trunk/1313/changes>

Changes:

[Jan Henrik Overland] (GIS) Minor bug fixed.

[Jan Henrik Overland] (GIS) Upgraded ExtJS lib version to 3.3.0

···

------------------------------------------
[...truncated 459 lines...]
-D dhis-2/dhis-web/dhis-web-mapping/src/main/webapp/dhis-web-mapping/resources/ext/resources/images/gray/tabs/tab-strip-bg.gif
-D dhis-2/dhis-web/dhis-web-mapping/src/main/webapp/dhis-web-mapping/resources/ext/resources/images/gray/tabs/tab-strip-bg.png
-D dhis-2/dhis-web/dhis-web-mapping/src/main/webapp/dhis-web-mapping/resources/ext/resources/images/gray/tabs/tab-strip-btm-bg.gif
-D dhis-2/dhis-web/dhis-web-mapping/src/main/webapp/dhis-web-mapping/resources/ext/resources/images/gray/tabs/tabs-sprite.gif
-D dhis-2/dhis-web/dhis-web-mapping/src/main/webapp/dhis-web-mapping/resources/ext/resources/images/gray/toolbar/
-D dhis-2/dhis-web/dhis-web-mapping/src/main/webapp/dhis-web-mapping/resources/ext/resources/images/gray/toolbar/bg.gif
-D dhis-2/dhis-web/dhis-web-mapping/src/main/webapp/dhis-web-mapping/resources/ext/resources/images/gray/toolbar/btn-arrow-light.gif
-D dhis-2/dhis-web/dhis-web-mapping/src/main/webapp/dhis-web-mapping/resources/ext/resources/images/gray/toolbar/btn-arrow.gif
-D dhis-2/dhis-web/dhis-web-mapping/src/main/webapp/dhis-web-mapping/resources/ext/resources/images/gray/toolbar/btn-over-bg.gif
-D dhis-2/dhis-web/dhis-web-mapping/src/main/webapp/dhis-web-mapping/resources/ext/resources/images/gray/toolbar/gray-bg.gif
-D dhis-2/dhis-web/dhis-web-mapping/src/main/webapp/dhis-web-mapping/resources/ext/resources/images/gray/toolbar/more.gif
-D dhis-2/dhis-web/dhis-web-mapping/src/main/webapp/dhis-web-mapping/resources/ext/resources/images/gray/toolbar/tb-bg.gif
-D dhis-2/dhis-web/dhis-web-mapping/src/main/webapp/dhis-web-mapping/resources/ext/resources/images/gray/toolbar/tb-btn-sprite.gif
-D dhis-2/dhis-web/dhis-web-mapping/src/main/webapp/dhis-web-mapping/resources/ext/resources/images/gray/tree/
-D dhis-2/dhis-web/dhis-web-mapping/src/main/webapp/dhis-web-mapping/resources/ext/resources/images/gray/tree/arrows.gif
-D dhis-2/dhis-web/dhis-web-mapping/src/main/webapp/dhis-web-mapping/resources/ext/resources/images/gray/tree/elbow-end-minus-nl.gif
-D dhis-2/dhis-web/dhis-web-mapping/src/main/webapp/dhis-web-mapping/resources/ext/resources/images/gray/tree/elbow-end-minus.gif
-D dhis-2/dhis-web/dhis-web-mapping/src/main/webapp/dhis-web-mapping/resources/ext/resources/images/gray/tree/elbow-end-plus-nl.gif
-D dhis-2/dhis-web/dhis-web-mapping/src/main/webapp/dhis-web-mapping/resources/ext/resources/images/gray/tree/elbow-end-plus.gif
-D dhis-2/dhis-web/dhis-web-mapping/src/main/webapp/dhis-web-mapping/resources/ext/resources/images/gray/window/
-D dhis-2/dhis-web/dhis-web-mapping/src/main/webapp/dhis-web-mapping/resources/ext/resources/images/gray/window/icon-error.gif
-D dhis-2/dhis-web/dhis-web-mapping/src/main/webapp/dhis-web-mapping/resources/ext/resources/images/gray/window/icon-info.gif
-D dhis-2/dhis-web/dhis-web-mapping/src/main/webapp/dhis-web-mapping/resources/ext/resources/images/gray/window/icon-question.gif
-D dhis-2/dhis-web/dhis-web-mapping/src/main/webapp/dhis-web-mapping/resources/ext/resources/images/gray/window/icon-warning.gif
-D dhis-2/dhis-web/dhis-web-mapping/src/main/webapp/dhis-web-mapping/resources/ext/resources/images/gray/window/left-corners.png
-D dhis-2/dhis-web/dhis-web-mapping/src/main/webapp/dhis-web-mapping/resources/ext/resources/images/gray/window/left-corners.pspimage
-D dhis-2/dhis-web/dhis-web-mapping/src/main/webapp/dhis-web-mapping/resources/ext/resources/images/gray/window/left-right.png
-D dhis-2/dhis-web/dhis-web-mapping/src/main/webapp/dhis-web-mapping/resources/ext/resources/images/gray/window/right-corners.png
-D dhis-2/dhis-web/dhis-web-mapping/src/main/webapp/dhis-web-mapping/resources/ext/resources/images/gray/window/top-bottom.png
-D dhis-2/dhis-web/dhis-web-mapping/src/main/webapp/dhis-web-mapping/resources/ext/resources/resources.jsb
M dhis-2/dhis-web/dhis-web-mapping/src/main/webapp/dhis-web-mapping/resources/mapfish/widgets/geostat/Choropleth.js
M dhis-2/dhis-web/dhis-web-mapping/src/main/webapp/dhis-web-mapping/resources/mapfish/widgets/geostat/Symbol.js
All changes applied successfully.
Now on revision 2354.
$ bzr revision-info -d "<http://dhis.uio.no/ci/job/Dhis2%20Service%20Trunk/ws/">
[workspace] $ bzr log -v -r revid:janhenrik.overland@gmail.com-20101012132615-ann6nz0rxbg0tcxk..revid:janhenrik.overland@gmail.com-20101012152607-un9fqjejwbm82k10 --long --show-ids
Getting local revision...
$ bzr revision-info -d "<http://dhis.uio.no/ci/job/Dhis2%20Service%20Trunk/ws/">
janhenrik.overland@gmail.com-20101012152607-un9fqjejwbm82k10
Parsing POMs
[dhis-2] $ /local/opt/j2sdk/bin/java -Xmx2048m -XX:MaxPermSize=512m -cp /ifi/utgard/p01/dhis/projects/dhis-dev.ifi.uio.no/ci/home/plugins/maven-plugin/WEB-INF/lib/maven-agent-1.375.jar:/ifi/utgard/p01/dhis/projects/dhis-dev.ifi.uio.no/ci/home/tools/2.2.1/boot/classworlds-1.1.jar hudson.maven.agent.Main /ifi/utgard/p01/dhis/projects/dhis-dev.ifi.uio.no/ci/home/tools/2.2.1 /ifi/utgard/p01/dhis/projects/dhis-dev.ifi.uio.no/ci/tomcat/webapps/ci/WEB-INF/lib/remoting-1.375.jar /ifi/utgard/p01/dhis/projects/dhis-dev.ifi.uio.no/ci/home/plugins/maven-plugin/WEB-INF/lib/maven-interceptor-1.375.jar 52403 /ifi/utgard/p01/dhis/projects/dhis-dev.ifi.uio.no/ci/home/plugins/maven-plugin/WEB-INF/lib/maven2.1-interceptor-1.2.jar
<===[HUDSON REMOTING CAPACITY]===> channel started
Executing Maven: -B -f <http://dhis.uio.no/ci/job/Dhis2%20Service%20Trunk/ws/dhis-2/pom.xml> clean install findbugs:findbugs
[INFO] Scanning for projects...
[INFO] Reactor build order:
[INFO] DHIS 2
[INFO] DHIS API
[INFO] DHIS Support Parent Project
[INFO] DHIS Test Support
[INFO] DHIS External Support
[INFO] DHIS Hibernate Support
[INFO] DHIS System Support
[INFO] DHIS JDBC Service
[INFO] DHIS Services Parent Project
[INFO] DHIS Core API Implementations
[INFO] DHIS XML framework services
[INFO] DHIS I18n Static
[INFO] DHIS Options
[INFO] DHIS Administration Service
[INFO] DHIS DataMart Service - Default
[INFO] DHIS Aggregation Service - Default
[INFO] DHIS OrganisationUnit API Implementations
[INFO] DHIS Reporting Service
[INFO] DHIS Import-Export Service
[INFO] DHIS Excel Reporting Service
[INFO] DHIS Patient API Implementations
[INFO] DHIS JDBC / External Test Project
[INFO] ------------------------------------------------------------------------
[INFO] Building DHIS 2
[INFO] task-segment: [clean, install, findbugs:findbugs]
[INFO] ------------------------------------------------------------------------
[INFO] [clean:clean {execution: default-clean}]
[INFO] [site:attach-descriptor {execution: default-attach-descriptor}]
[INFO] [install:install {execution: default-install}]
[INFO] Installing <http://dhis.uio.no/ci/job/Dhis2%20Service%20Trunk/ws/dhis-2/pom.xml> to /ifi/utgard/p01/dhis/.m2/repository/org/hisp/dhis/dhis/2.0.6-SNAPSHOT/dhis-2.0.6-SNAPSHOT.pom
[INFO] Preparing findbugs:findbugs
[INFO] No goals needed for project - skipping
[HUDSON] Archiving <http://dhis.uio.no/ci/job/Dhis2%20Service%20Trunk/ws/dhis-2/pom.xml> to /ifi/utgard/p01/dhis/projects/dhis-dev.ifi.uio.no/ci/home/jobs/Dhis2 Service Trunk/modules/org.hisp.dhis$dhis/builds/2010-10-12_17-31-31/archive/org.hisp.dhis/dhis/2.0.6-SNAPSHOT/pom.xml
[HUDSON] Archiving /ifi/utgard/p01/dhis/.m2/repository/org/hisp/dhis/dhis/2.0.6-SNAPSHOT/dhis-2.0.6-SNAPSHOT.pom to /ifi/utgard/p01/dhis/projects/dhis-dev.ifi.uio.no/ci/home/jobs/Dhis2 Service Trunk/modules/org.hisp.dhis$dhis/builds/2010-10-12_17-31-31/archive/org.hisp.dhis/dhis/2.0.6-SNAPSHOT/dhis-2.0.6-SNAPSHOT.pom
[INFO] Setting property: classpath.resource.loader.class => 'org.codehaus.plexus.velocity.ContextClassLoaderResourceLoader'.
[INFO] Setting property: velocimacro.messages.on => 'false'.
[INFO] Setting property: resource.loader => 'classpath'.
[INFO] Setting property: resource.manager.logwhenfound => 'false'.
[INFO] **************************************************************
[INFO] Starting Jakarta Velocity v1.4
[INFO] RuntimeInstance initializing.
[INFO] Default Properties File: org/apache/velocity/runtime/defaults/velocity.properties
[INFO] Default ResourceManager initializing. (class org.apache.velocity.runtime.resource.ResourceManagerImpl)
[INFO] Resource Loader Instantiated: org.codehaus.plexus.velocity.ContextClassLoaderResourceLoader
[INFO] ClasspathResourceLoader : initialization starting.
[INFO] ClasspathResourceLoader : initialization complete.
[INFO] ResourceCache : initialized. (class org.apache.velocity.runtime.resource.ResourceCacheImpl)
[INFO] Default ResourceManager initialization complete.
[INFO] Loaded System Directive: org.apache.velocity.runtime.directive.Literal
[INFO] Loaded System Directive: org.apache.velocity.runtime.directive.Macro
[INFO] Loaded System Directive: org.apache.velocity.runtime.directive.Parse
[INFO] Loaded System Directive: org.apache.velocity.runtime.directive.Include
[INFO] Loaded System Directive: org.apache.velocity.runtime.directive.Foreach
[INFO] Created: 20 parsers.
[INFO] Velocimacro : initialization starting.
[INFO] Velocimacro : adding VMs from VM library template : VM_global_library.vm
[ERROR] ResourceManager : unable to find resource 'VM_global_library.vm' in any resource loader.
[INFO] Velocimacro : error using VM library template VM_global_library.vm : org.apache.velocity.exception.ResourceNotFoundException: Unable to find resource 'VM_global_library.vm'
[INFO] Velocimacro : VM library template macro registration complete.
[INFO] Velocimacro : allowInline = true : VMs can be defined inline in templates
[INFO] Velocimacro : allowInlineToOverride = false : VMs defined inline may NOT replace previous VM definitions
[INFO] Velocimacro : allowInlineLocal = false : VMs defined inline will be global in scope if allowed.
[INFO] Velocimacro : initialization complete.
[INFO] Velocity successfully started.
[INFO] [findbugs:findbugs {execution: default-cli}]
[INFO] Using source root:
[INFO] <http://dhis.uio.no/ci/job/Dhis2%20Service%20Trunk/ws/dhis-2/target/classes>
[INFO] Using test source root:
[INFO] <http://dhis.uio.no/ci/job/Dhis2%20Service%20Trunk/ws/dhis-2/target/test-classes>
[INFO] Output class directory doesn't exist. Skipping findbugs.
[INFO] ------------------------------------------------------------------------
[INFO] Building DHIS API
[INFO] task-segment: [clean, install, findbugs:findbugs]
[INFO] ------------------------------------------------------------------------
[INFO] [clean:clean {execution: default-clean}]
[INFO] Deleting directory <http://dhis.uio.no/ci/job/Dhis2%20Service%20Trunk/ws/dhis-2/dhis-api/target>
[INFO] [resources:resources {execution: default-resources}]
[INFO] Using encoding: 'UTF-8' to copy filtered resources.
[INFO] [compiler:compile {execution: default-compile}]
[INFO] Compiling 346 source files to <http://dhis.uio.no/ci/job/Dhis2%20Service%20Trunk/ws/dhis-2/dhis-api/target/classes>
[INFO] [resources:testResources {execution: default-testResources}]
[INFO] Using encoding: 'UTF-8' to copy filtered resources.
[INFO] [compiler:testCompile {execution: default-testCompile}]
[INFO] Compiling 8 source files to <http://dhis.uio.no/ci/job/Dhis2%20Service%20Trunk/ws/dhis-2/dhis-api/target/test-classes>
[INFO] [surefire:test {execution: default-test}]
[INFO] Surefire report directory: <http://dhis.uio.no/ci/job/Dhis2%20Service%20Trunk/ws/dhis-2/dhis-api/target/surefire-reports>

-------------------------------------------------------
T E S T S
-------------------------------------------------------
Running org.hisp.dhis.dataelement.DimensionTest
Tests run: 1, Failures: 0, Errors: 0, Skipped: 0, Time elapsed: 0.119 sec
Running org.hisp.dhis.period.RelativePeriodTest
Tests run: 3, Failures: 0, Errors: 0, Skipped: 0, Time elapsed: 0.097 sec
Running org.hisp.dhis.dataentryform.DataEntryFormTest
Tests run: 2, Failures: 0, Errors: 0, Skipped: 0, Time elapsed: 0.036 sec
Running org.hisp.dhis.period.WeeklyPeriodTypeTest
Tests run: 2, Failures: 0, Errors: 0, Skipped: 1, Time elapsed: 0.011 sec
Running org.hisp.dhis.dataelement.OperandTest
Tests run: 2, Failures: 0, Errors: 0, Skipped: 0, Time elapsed: 0.023 sec
Running org.hisp.dhis.organisationunit.OrganisationUnitTest
Tests run: 2, Failures: 0, Errors: 0, Skipped: 0, Time elapsed: 0.021 sec
Running org.hisp.dhis.dataelement.DataElementTest
Tests run: 2, Failures: 0, Errors: 0, Skipped: 0, Time elapsed: 0.011 sec
Running org.hisp.dhis.organisationunit.OrganisationUnitHierarchyTest
Tests run: 1, Failures: 0, Errors: 0, Skipped: 0, Time elapsed: 0.019 sec

Results :

Tests run: 15, Failures: 0, Errors: 0, Skipped: 1

[HUDSON] Recording test results
[INFO] [jar:jar {execution: default-jar}]
[INFO] Building jar: <http://dhis.uio.no/ci/job/Dhis2%20Service%20Trunk/ws/dhis-2/dhis-api/target/dhis-api-2.0.6-SNAPSHOT.jar>
[INFO] [install:install {execution: default-install}]
[INFO] Installing <http://dhis.uio.no/ci/job/Dhis2%20Service%20Trunk/ws/dhis-2/dhis-api/target/dhis-api-2.0.6-SNAPSHOT.jar> to /ifi/utgard/p01/dhis/.m2/repository/org/hisp/dhis/dhis-api/2.0.6-SNAPSHOT/dhis-api-2.0.6-SNAPSHOT.jar
[INFO] Preparing findbugs:findbugs
[HUDSON] Archiving <http://dhis.uio.no/ci/job/Dhis2%20Service%20Trunk/ws/dhis-2/dhis-api/pom.xml> to /ifi/utgard/p01/dhis/projects/dhis-dev.ifi.uio.no/ci/home/jobs/Dhis2 Service Trunk/modules/org.hisp.dhis$dhis-api/builds/2010-10-12_17-31-31/archive/org.hisp.dhis/dhis-api/2.0.6-SNAPSHOT/pom.xml
[HUDSON] Archiving <http://dhis.uio.no/ci/job/Dhis2%20Service%20Trunk/ws/dhis-2/dhis-api/target/dhis-api-2.0.6-SNAPSHOT.jar> to /ifi/utgard/p01/dhis/projects/dhis-dev.ifi.uio.no/ci/home/jobs/Dhis2 Service Trunk/modules/org.hisp.dhis$dhis-api/builds/2010-10-12_17-31-31/archive/org.hisp.dhis/dhis-api/2.0.6-SNAPSHOT/dhis-api-2.0.6-SNAPSHOT.jar
[INFO] [resources:resources {execution: default-resources}]
[INFO] Using encoding: 'UTF-8' to copy filtered resources.
[INFO] [compiler:compile {execution: default-compile}]
[INFO] Nothing to compile - all classes are up to date
[INFO] [findbugs:findbugs {execution: default-cli}]
[INFO] Using source root:
[INFO] <http://dhis.uio.no/ci/job/Dhis2%20Service%20Trunk/ws/dhis-2/dhis-api/target/classes>
[INFO] Using test source root:
[INFO] <http://dhis.uio.no/ci/job/Dhis2%20Service%20Trunk/ws/dhis-2/dhis-api/target/test-classes>
[INFO] No effort provided, using default effort.
[INFO] Adding Source Directory: <http://dhis.uio.no/ci/job/Dhis2%20Service%20Trunk/ws/dhis-2/dhis-api/src/main/java>
[INFO] No threshold provided, using default threshold.
[INFO] Using FindBugs Version: 1.3.8
[INFO] No threshold provided, using default threshold.
[INFO] No threshold provided, using default threshold.
[INFO] No threshold provided, using default threshold.
[INFO] Using the xdoc format
[INFO] No effort provided, using default effort.
[INFO] No threshold provided, using default threshold.
[INFO] No threshold provided, using default threshold.
[INFO] Debugging is Off
[INFO] No bug include filter.
[INFO] Using bug exclude filter /tmp/plexus-resources406746953tmp
[INFO] Printing Errors
[INFO] Printing Missing classes
[INFO] Printing Source Roots
log4j:WARN No appenders could be found for logger (org.apache.commons.digester.Digester.sax).
log4j:WARN Please initialize the log4j system properly.
[FINDBUGS] Successfully parsed file <http://dhis.uio.no/ci/job/Dhis2%20Service%20Trunk/ws/dhis-2/dhis-api/target/findbugsXml.xml> of module DHIS API with 115 warnings.
[INFO] ------------------------------------------------------------------------
[INFO] Building DHIS Support Parent Project
[INFO] task-segment: [clean, install, findbugs:findbugs]
[INFO] ------------------------------------------------------------------------
[INFO] [clean:clean {execution: default-clean}]
[INFO] [site:attach-descriptor {execution: default-attach-descriptor}]
[INFO] [install:install {execution: default-install}]
[INFO] Installing <http://dhis.uio.no/ci/job/Dhis2%20Service%20Trunk/ws/dhis-2/dhis-support/pom.xml> to /ifi/utgard/p01/dhis/.m2/repository/org/hisp/dhis/dhis-support/2.0.6-SNAPSHOT/dhis-support-2.0.6-SNAPSHOT.pom
[INFO] Preparing findbugs:findbugs
[INFO] No goals needed for project - skipping
[INFO] [findbugs:findbugs {execution: default-cli}]
[INFO] Using source root:
[INFO] <http://dhis.uio.no/ci/job/Dhis2%20Service%20Trunk/ws/dhis-2/dhis-support/target/classes>
[INFO] Using test source root:
[INFO] <http://dhis.uio.no/ci/job/Dhis2%20Service%20Trunk/ws/dhis-2/dhis-support/target/test-classes>
[INFO] Output class directory doesn't exist. Skipping findbugs.
[HUDSON] Archiving <http://dhis.uio.no/ci/job/Dhis2%20Service%20Trunk/ws/dhis-2/dhis-support/pom.xml> to /ifi/utgard/p01/dhis/projects/dhis-dev.ifi.uio.no/ci/home/jobs/Dhis2 Service Trunk/modules/org.hisp.dhis$dhis-support/builds/2010-10-12_17-31-32/archive/org.hisp.dhis/dhis-support/2.0.6-SNAPSHOT/pom.xml
[HUDSON] Archiving /ifi/utgard/p01/dhis/.m2/repository/org/hisp/dhis/dhis-support/2.0.6-SNAPSHOT/dhis-support-2.0.6-SNAPSHOT.pom to /ifi/utgard/p01/dhis/projects/dhis-dev.ifi.uio.no/ci/home/jobs/Dhis2 Service Trunk/modules/org.hisp.dhis$dhis-support/builds/2010-10-12_17-31-32/archive/org.hisp.dhis/dhis-support/2.0.6-SNAPSHOT/dhis-support-2.0.6-SNAPSHOT.pom
[INFO] ------------------------------------------------------------------------
[INFO] Building DHIS Test Support
[INFO] task-segment: [clean, install, findbugs:findbugs]
[INFO] ------------------------------------------------------------------------
[INFO] [clean:clean {execution: default-clean}]
[INFO] Deleting directory <http://dhis.uio.no/ci/job/Dhis2%20Service%20Trunk/ws/dhis-2/dhis-support/dhis-support-test/target>
[INFO] [resources:resources {execution: default-resources}]
[INFO] Using encoding: 'UTF-8' to copy filtered resources.
[INFO] [compiler:compile {execution: default-compile}]
[INFO] Compiling 6 source files to <http://dhis.uio.no/ci/job/Dhis2%20Service%20Trunk/ws/dhis-2/dhis-support/dhis-support-test/target/classes>
[HUDSON] Archiving <http://dhis.uio.no/ci/job/Dhis2%20Service%20Trunk/ws/dhis-2/dhis-support/dhis-support-test/pom.xml> to /ifi/utgard/p01/dhis/projects/dhis-dev.ifi.uio.no/ci/home/jobs/Dhis2 Service Trunk/modules/org.hisp.dhis$dhis-support-test/builds/2010-10-12_17-31-32/archive/org.hisp.dhis/dhis-support-test/2.0.6-SNAPSHOT/pom.xml
[INFO] ------------------------------------------------------------------------
[ERROR] BUILD FAILURE
[INFO] ------------------------------------------------------------------------
[INFO] Compilation failure

<http://dhis.uio.no/ci/job/Dhis2%20Service%20Trunk/ws/dhis-2/dhis-support/dhis-support-test/src/main/java/org/hisp/dhis/DhisConvenienceTest.java>:[800,11] cannot find symbol
symbol : method setLongitude(java.lang.String)
location: class org.hisp.dhis.mapping.Map

<http://dhis.uio.no/ci/job/Dhis2%20Service%20Trunk/ws/dhis-2/dhis-support/dhis-support-test/src/main/java/org/hisp/dhis/DhisConvenienceTest.java>:[801,11] cannot find symbol
symbol : method setLatitude(java.lang.String)
location: class org.hisp.dhis.mapping.Map

<http://dhis.uio.no/ci/job/Dhis2%20Service%20Trunk/ws/dhis-2/dhis-support/dhis-support-test/src/main/java/org/hisp/dhis/DhisConvenienceTest.java>:[802,11] cannot find symbol
symbol : method setZoom(int)
location: class org.hisp.dhis.mapping.Map

[INFO] ------------------------------------------------------------------------
[INFO] For more information, run Maven with the -e switch
[INFO] ------------------------------------------------------------------------
[INFO] Total time: 1 minute 59 seconds
[INFO] Finished at: Tue Oct 12 17:33:37 CEST 2010
[INFO] Final Memory: 70M/250M
[INFO] ------------------------------------------------------------------------
Sending e-mails to: dhis2-devs@lists.launchpad.net
channel stopped

See <http://dhis.uio.no/ci/job/Dhis2%20Service%20Trunk/1314/changes>